Cyano radical
- Formula: CN
- Molecular weight: 26.0174
- IUPAC Standard InChIKey: JEVCWSUVFOYBFI-UHFFFAOYSA-N
- CAS Registry Number: 2074-87-5
- Chemical structure:
View 3d structure (requires JavaScript / HTML 5) - Permanent link for this species. Use this link for bookmarking this species for future reference.

Gas phase thermochemistry data

Quantity | Value | Units | Method | Reference | Comment |
---|---|---|---|---|---|
ΔfH°gas | 435.14 | kJ/mol | Review | Chase, 1998 | Data last reviewed in June, 1969 |
Quantity | Value | Units | Method | Reference | Comment |
S°gas,1 bar | 202.64 | J/mol*K | Review | Chase, 1998 | Data last reviewed in June, 1969 |
Gas Phase Heat Capacity (Shomate Equation)
Cp° = A + B*t + C*t2 + D*t3 +
E/t2
H° − H°298.15= A*t + B*t2/2 +
C*t3/3 + D*t4/4 − E/t + F − H
S° = A*ln(t) + B*t + C*t2/2 + D*t3/3 −
E/(2*t2) + G
Cp = heat capacity (J/mol*K)
H° = standard enthalpy (kJ/mol)
S° = standard entropy (J/mol*K)
t = temperature (K) / 1000.
View plot Requires a JavaScript / HTML 5 canvas capable browser.
Temperature (K) | 298. to 1100. | 1100. to 6000. |
---|---|---|
A | 26.32878 | 21.01661 |
B | 3.322704 | 9.770603 |
C | 8.590883 | -1.022633 |
D | -4.875490 | 0.013773 |
E | 0.107055 | 4.541439 |
F | 427.4333 | 435.9017 |
G | 233.7785 | 232.6902 |
H | 435.1360 | 435.1360 |
Reference | Chase, 1998 | Chase, 1998 |
Comment | Data last reviewed in June, 1969 | Data last reviewed in June, 1969 |

Gas phase ion energetics data

Data evaluated as indicated in comments:
HL - Edward P. Hunter and Sharon G. Lias
L - Sharon G. Lias
Data compiled as indicated in comments:
B - John E. Bartmess
LLK - Sharon G. Lias, Rhoda D. Levin, and Sherif A. Kafafi
RDSH - Henry M. Rosenstock, Keith Draxl, Bruce W. Steiner, and John T. Herron
Quantity | Value | Units | Method | Reference | Comment |
---|---|---|---|---|---|
IE (evaluated) | 13.598 | eV | N/A | N/A | L |
Quantity | Value | Units | Method | Reference | Comment |
ΔfH°(+) ion | 419. ± 1. | kcal/mol | N/A | N/A |
Electron affinity determinations
EA (eV) | Method | Reference | Comment |
---|---|---|---|
3.8620 ± 0.0050 | LPES | Bradforth, Kim, et al., 1993 | B |
3.835 ± 0.091 | D-EA | Bartmess, Scott, et al., 1979 | value altered from reference due to change in acidity scale; B |
3.820 ± 0.020 | PD | Berkowitz, Chupka, et al., 1969 | B |
5.64 ± 0.20 | R-A | DeCorpo, Bafus, et al., 1971 | From MeCN; B |
3.16124 | SI | Chamberlin, Page, et al., 1974 | The Magnetron method, lacking mass analysis, is not considered reliable.; B |
2.78398 | SI | Page, 1972 | The Magnetron method, lacking mass analysis, is not considered reliable.; B |
2.800 ± 0.020 | SI | Napper and Page, 1963 | New DH(H-CN) used The Magnetron method, lacking mass analysis, is not considered reliable.; B |
Ionization energy determinations
IE (eV) | Method | Reference | Comment |
---|---|---|---|
14.17 | EVAL | Huber and Herzberg, 1979 | LLK |
14.03 ± 0.02 | DER | Berkowitz, Chupka, et al., 1969 | RDSH |
≤14.20 ± 0.02 | DER | Dibeler and Liston, 1967 | RDSH |
14.2 ± 0.3 | EI | Berkowitz, 1962 | RDSH |
14.5 ± 0.2 | EI | Dibeler, Reese, et al., 1961 | RDSH |
Anion protonation reactions
CN- + =
Quantity | Value | Units | Method | Reference | Comment |
---|---|---|---|---|---|
ΔrH° | 349.8 ± 1.0 | kcal/mol | CIDT | Akin and Ervin, 2006 | gas phase; B |
ΔrH° | 350.50 ± 0.17 | kcal/mol | D-EA | Bradforth, Kim, et al., 1993 | gas phase; B |
ΔrH° | 351.1 ± 2.1 | kcal/mol | G+TS | Bartmess, Scott, et al., 1979 | gas phase; value altered from reference due to change in acidity scale; B |
Quantity | Value | Units | Method | Reference | Comment |
ΔrG° | 342.5 ± 1.1 | kcal/mol | H-TS | Akin and Ervin, 2006 | gas phase; B |
ΔrG° | 343.17 ± 0.27 | kcal/mol | H-TS | Bradforth, Kim, et al., 1993 | gas phase; B |
ΔrG° | 343.8 ± 2.0 | kcal/mol | IMRE | Bartmess, Scott, et al., 1979 | gas phase; value altered from reference due to change in acidity scale; B |

Constants of diatomic molecules

Data compiled by: Klaus P. Huber and Gerhard H. Herzberg
Data collected through September, 1976
Symbol | Meaning |
---|---|
State | electronic state and / or symmetry symbol |
Te | minimum electronic energy (cm-1) |
ωe | vibrational constant – first term (cm-1) |
ωexe | vibrational constant – second term (cm-1) |
ωeye | vibrational constant – third term (cm-1) |
Be | rotational constant in equilibrium position (cm-1) |
αe | rotational constant – first term (cm-1) |
γe | rotation-vibration interaction constant (cm-1) |
De | centrifugal distortion constant (cm-1) |
βe | rotational constant – first term, centrifugal force (cm-1) |
re | internuclear distance (Å) |
Trans. | observed transition(s) corresponding to electronic state |
ν00 | position of 0-0 band (units noted in table) |
State | Te | ωe | ωexe | ωeye | Be | αe | γe | De | βe | re | Trans. | ν00 |
---|---|---|---|---|---|---|---|---|---|---|---|---|
Theoretical work Purcell, 1967 Heil and Schaefer, 1971 Schaefer and Heil, 1971 Green, 1972 Das, Janis, et al., 1974. RKR Potential curves Fallon, Vanderslice, et al., 1962 Brocklehurst, Hebert, et al., 1971 Rao and Lakshman, 1972.Franck-Condon factors Halmann and Laulicht, 1966 Rao and Lakshman, 1972, and ref. In Ortenberg and Antropov, 1967 Brocklehurst, Hebert, et al., 1971. | ||||||||||||
J 2ΔI | 65258.19 1 | 1121.76 Z | 14.203 | 0.180 | 1.3052 | 0.0208 | 5.8E-6 | 1.4137 | J → A R | 55667.14 2 Z | ||
↳missing citation | ||||||||||||
H 2Π(r) | [61969.7] 3 | [1.520] | [1.310] | H → B R | 35140.84 2 Z | |||||||
↳Douglas and Routly, 1955 | ||||||||||||
G 2Π | [61655.0] 4 5 | [1.085] 4 | [1.551] | G → B R | 34826.10 4 Z | |||||||
↳Douglas and Routly, 1955; Lutz, 1970 | ||||||||||||
State | Te | ωe | ωexe | ωeye | Be | αe | γe | De | βe | re | Trans. | ν00 |
F 2Δr | 60095.64 $I | 1239.50 Z | 12.75 | 1.3834 | 0.0187 | 7E-6 | 1.3732 | F → A R | 50563.80 2 Z | |||
↳missing citation; Jha and Rao, 1966; Lutz, 1971 | ||||||||||||
E 2Σ+ | 59151.18 | 1681.43 Z | 3.60 | -1.02 | 1.4871 | 0.00643 | -0.00077 | 5.0E-6 | 1.3245 | E → A R | 49842.47 | |
↳missing citation; Lutz, 1971 | ||||||||||||
E ↔ X R | 58959.85 Z | |||||||||||
↳missing citation; missing citation | ||||||||||||
D 2ΠI | 54486.3 6 | 1004.71 7 Z | 8.78 | 1.162 7 | 0.013 | 7E-6 | 1.498 | D → A R | 44838.08 2 z | |||
↳missing citation | ||||||||||||
D → X R | 53955.46 | |||||||||||
↳missing citation | ||||||||||||
State | Te | ωe | ωexe | ωeye | Be | αe | γe | De | βe | re | Trans. | ν00 |
a 4Σ(+) | (32400) 8 | |||||||||||
B 2Σ+ | 25752.0 | 2163.9 9 Z | 20.2 10 | 1.973 9 | 0.023 10 | [6.6E-6] | 1.15 | B → A V | 16680.46 | |||
↳LeBlanc, 1968; missing citation | ||||||||||||
11 | B ↔ X 12 13 VR | 25797.84 14 | ||||||||||
↳missing citation; missing citation; White, 1940; Feast, 1949; Douglas and Routly, 1955; Kiess and Broida, 1961; LeBlanc, 1968, 2; Engleman, 1974 | ||||||||||||
A 2ΠI | 9245.28 15 | 1812.56 16 Z | 12.609 | -0.0118 | 1.7151 16 | 0.01708 | -0.0000364 | 5.93E-6 16 | 0.0425E-6 | 1.2333 | A ↔ X 17 18 R | 9117.38 2 Z |
↳missing citation; Parker, 1932; Herzberg and Phillips, 1948; Douglas and Routly, 1955; Kiess and Broida, 1961; Davis and Phillips, 1963; Weinberg, Fishburne, et al., 1967; LeBlanc, 1968, 2; missing citation | ||||||||||||
19 | ||||||||||||
State | Te | ωe | ωexe | ωeye | Be | αe | γe | De | βe | re | Trans. | ν00 |
X 2Σ+ | 0 | 2068.59 Z | 13.087 20 | -0.009093 | 1.89974 14 | 0.017369 | -0.00003107 21 | 6.40E-6 | 0.000000012 22 | 1.17182 23 | ||
↳Phillips, 1973; Treffers, 1975 | ||||||||||||
Microwave sp. 24 | ||||||||||||
↳Penzias, Wilson, et al., 1974; Turner and Gammon, 1975 | ||||||||||||
ESR sp. 25 | ||||||||||||
↳Easley and Weltner, 1970; Adrian and Bowers, 1976 |

References

Chase, 1998
Chase, M.W., Jr.,
NIST-JANAF Themochemical Tables, Fourth Edition,
J. Phys. Chem. Ref. Data, Monograph 9, 1998, 1-1951. [all data]