Cyclohexanol, 5-methyl-2-(1-methylethyl)-, [1R-(1α,2α,5β)]-
- Formula: C10H20O
- Molecular weight: 156.2652
- IUPAC Standard InChIKey: NOOLISFMXDJSKH-UTLUCORTSA-N
- CAS Registry Number: 20747-49-3
- Chemical structure:
View 3d structure (requires JavaScript / HTML 5) - Stereoisomers:
- Cyclohexanol, 5-methyl-2-(1-methylethyl)-
- Cyclohexanol, 5-methyl-2-(1-methylethyl)-, (1α,2β,5α)-
- Levomenthol
- Cyclohexanol, 5-methyl-2-(1-methylethyl)-, [1S-(1α,2α,5β)]-
- Cyclohexanol, 5-methyl-2-(1-methylethyl)-, [1S-(1α,2β,5β)]-
- Cyclohexanol, 5-methyl-2-(1-methylethyl)-, (1α,2β,5β)-
- Cyclohexanol, 5-methyl-2-(1-methylethyl)-, (1α,2α,5β)-
- Cyclohexanol, 5-methyl-2-(1-methylethyl)-, (1α,2α,5α)-
- Cyclohexanol, 5-methyl-2-(1-methylethyl)-, (1α,2β,5α)-

Phase change data

Data compiled by: Robert L. Brown and Stephen E. Stein
Reduced pressure boiling point
Tboil (K) | Pressure (bar) | Reference |
---|---|---|
370.8 | 0.013 | Weast and Grasselli, 1989 |

References

Weast and Grasselli, 1989
CRC Handbook of Data on Organic Compounds, 2nd Editon, Weast,R.C and Grasselli, J.G., ed(s)., CRC Press, Inc., Boca Raton, FL, 1989, 1. [all data]