4-Hexyn-3-ol
- Formula: C6H10O
- Molecular weight: 98.1430
- IUPAC Standard InChIKey: KARLLBDFLHNKBO-UHFFFAOYSA-N
- CAS Registry Number: 20739-59-7
- Chemical structure:
View 3d structure (requires JavaScript / HTML 5) - Permanent link for this species. Use this link for bookmarking this species for future reference.

Phase change data

Data compiled by: Robert L. Brown and Stephen E. Stein
Reduced pressure boiling point
Tboil (K) | Pressure (bar) | Reference |
---|---|---|
368. | 0.140 | Farchan Laboratories, 1990 |

References

Farchan Laboratories, 1990
Farchan Laboratories,
Research Chemicals Catalog, Farchan Laboratories, Gainesville, FL, 1990, 91. [all data]