2-Octyn-1-ol
- Formula: C8H14O
- Molecular weight: 126.1962
- IUPAC Standard InChIKey: TTWYFVOMGMBZCF-UHFFFAOYSA-N
- CAS Registry Number: 20739-58-6
- Chemical structure:
View 3d structure (requires JavaScript / HTML 5) - Other names: Oct-2-yn-1-ol

Condensed phase thermochemistry data

Data compiled as indicated in comments:
DRB - Donald R. Burgess, Jr.
ALS - Hussein Y. Afeefy, Joel F. Liebman, and Stephen E. Stein
Quantity | Value | Units | Method | Reference | Comment |
---|---|---|---|---|---|
ΔfH°liquid | -155.7 ± 4.0 | kJ/mol | Ccb | N/A | recalculated with modern CO2,H2O thermo; estimated uncertainty (NOTE all values in source also have wrong sign); DRB |
ΔfH°liquid | 200. | kJ/mol | Ccb | Moureu and Andre, 1914 | ALS |
Quantity | Value | Units | Method | Reference | Comment |
ΔcH°liquid | -4993.2 | kJ/mol | Ccb | Moureu and Andre, 1914 | Corresponding ΔfHºliquid = -156. kJ/mol (simple calculation by NIST; no Washburn corrections); ALS |

Phase change data

Data compiled by: Robert L. Brown and Stephen E. Stein
Reduced pressure boiling point
Tboil (K) | Pressure (bar) | Reference |
---|---|---|
376. to 379. | 0.032 | Farchan Laboratories, 1990 |

References

Moureu and Andre, 1914
Moureu, C.; Andre, E.,
Thermochimie des composes acetyleniques,
Ann. Chim. Phys., 1914, 1, 113-145. [all data]
Farchan Laboratories, 1990
Farchan Laboratories,
Research Chemicals Catalog, Farchan Laboratories, Gainesville, FL, 1990, 91. [all data]