Benzo[k]fluoranthene
- Formula: C20H12
- Molecular weight: 252.3093
- IUPAC Standard InChIKey: HAXBIWFMXWRORI-UHFFFAOYSA-N
- CAS Registry Number: 207-08-9
- Chemical structure:
View 3d structure (requires JavaScript / HTML 5) - Other names: Dibenzo[b,jk]fluorene; 11,12-Benzofluoranthene; 2,3,1',8'-Binaphthylene; 8,9-Benzofluoranthene

Gas phase thermochemistry data

Data compiled as indicated in comments:
DRB - Donald R. Burgess, Jr.
GT - Glushko Thermocenter, Russian Academy of Sciences, Moscow
Quantity | Value | Units | Method | Reference | Comment |
---|---|---|---|---|---|
ΔfH°gas | 306.2 ± 6.2 | kJ/mol | Review | Roux, Temprado, et al., 2008 | There are insufficient literature values to properly evaluated the data and measurements are of low quality and/or there is substantial disagreement with values predicted using thermochemical cycles or estimation methods (trends).; DRB |
Constant pressure heat capacity of gas
Cp,gas (J/mol*K) | Temperature (K) | Reference | Comment |
---|---|---|---|
49.78 | 50. | Dorofeeva O.V., 1989 | These statistically calculated values were obtained using force field approximation for polycyclic aromatic hydrocarbons to estimate the needed vibrational frequencies (see also [ Dorofeeva O.V., 1986, Moiseeva N.F., 1990]). These functions are reproduced in the reference book [ Frenkel M., 1994].; GT |
80.91 | 100. | ||
118.58 | 150. | ||
161.68 | 200. | ||
229.41 | 273.15 | ||
252.6 ± 3.5 | 298.15 | ||
254.30 | 300. | ||
340.92 | 400. | ||
413.05 | 500. | ||
470.62 | 600. | ||
516.46 | 700. | ||
553.40 | 800. | ||
583.59 | 900. | ||
608.59 | 1000. | ||
629.48 | 1100. | ||
647.08 | 1200. | ||
662.01 | 1300. | ||
674.75 | 1400. | ||
685.69 | 1500. |

Condensed phase thermochemistry data

Data compiled by: Donald R. Burgess, Jr.
Quantity | Value | Units | Method | Reference | Comment |
---|---|---|---|---|---|
ΔfH°solid | 172.4 ± 4.3 | kJ/mol | Review | Roux, Temprado, et al., 2008 | There are insufficient literature values to properly evaluated the data and measurements are of low quality and/or there is substantial disagreement with values predicted using thermochemical cycles or estimation methods (trends). |

Phase change data

Data compiled as indicated in comments:
BS - Robert L. Brown and Stephen E. Stein
AC - William E. Acree, Jr., James S. Chickos
DRB - Donald R. Burgess, Jr.
Quantity | Value | Units | Method | Reference | Comment |
---|---|---|---|---|---|
Tboil | 753.2 | K | N/A | Weast and Grasselli, 1989 | BS |
Tboil | 753. | K | N/A | Buckingham and Donaghy, 1982 | BS |
Quantity | Value | Units | Method | Reference | Comment |
Tfus | 490. | K | N/A | Buckingham and Donaghy, 1982 | BS |
Quantity | Value | Units | Method | Reference | Comment |
ΔvapH° | 117.4 ± 1.1 | kJ/mol | CGC | Hanshaw, Nutt, et al., 2008 | AC |
ΔvapH° | 105.5 ± 1.5 | kJ/mol | GC | Haftka, Parsons, et al., 2006 | Based on data from 463. to 513. K.; AC |
Quantity | Value | Units | Method | Reference | Comment |
ΔsubH° | 133.8 ± 4.5 | kJ/mol | Review | Roux, Temprado, et al., 2008 | There are sufficient literature values to make a qualified recommendation where the suggested value is in good agreement with values predicted using thermochemical cycles or from reliable estimates. In general, the evaluated uncertainty limits are on the order of (2 to 4) kJ/mol.; DRB |
ΔsubH° | 124.2 ± 4.7 | kJ/mol | ME | Diogo and Minas da Piedade, 2002 | Based on data from 387. to 423. K.; AC |
Enthalpy of vaporization
ΔvapH (kJ/mol) | Temperature (K) | Method | Reference | Comment |
---|---|---|---|---|
88.5 | 398. | GC | Lei, Chankalal, et al., 2002 | Based on data from 323. to 473. K.; AC |
Enthalpy of sublimation
ΔsubH (kJ/mol) | Temperature (K) | Reference | Comment |
---|---|---|---|
130. | 378. | Stephenson and Malanowski, 1987 | Based on data from 363. to 430. K.; AC |
Enthalpy of fusion
ΔfusH (kJ/mol) | Temperature (K) | Method | Reference | Comment |
---|---|---|---|---|
32.4 | 489.7 | DSC | Kestens, Auclair, et al., 2010 | AC |
27.5 | 490.6 | N/A | Diogo and Minas da Piedade, 2002 | AC |

Kovats' RI, non-polar column, isothermal

View large format table.

Column type Active phase Temperature (C) I Reference Comment
CapillaryOV-101270.2761.Grimmer and Böhnke, 1972N2; Column length: 50. m; Column diameter: 0.50 mm

Van Den Dool and Kratz RI, non-polar column, temperature ramp

View large format table.

Column type Active phase I Reference Comment
CapillarySE-522702.Beernaert, 1979He, 50. C @ 5. min, 6. K/min; Column length: 33.3 m; Column diameter: 0.50 mm; Tend: 320. C
CapillarySE-522706.Carugno and Rossi, 1967N2, 1.8 K/min; Column length: 65. m; Column diameter: 0.3 mm; Tstart: 100. C; Tend: 300. C

Van Den Dool and Kratz RI, non-polar column, custom temperature program

View large format table.

Column type Active phase I Reference Comment
CapillaryHP-12722.Dimitriou-Christidis, Harris, et al., 200330. m/0.25 mm/0.25 μm; Program: 60C => 7C/min => 225C => 15C/min => 300C(11.43min)
CapillaryHP-52789.11Dimitriou-Christidis, Harris, et al., 200330. m/0.25 mm/0.25 μm; Program: 60C => 7C/min => 225C => 15C/min => 300C(11.43min)
CapillaryDB-52780.Havenga and Rohwer, 199930. m/0.25 mm/0.25 μm, He; Program: 60 0C 7 0C/min -> 130 0C 5 0C/min -> 200 0C 6 0C/min -> 260 0C 20 0C/min -> 320 0C (4 min)

Normal alkane RI, non-polar column, temperature ramp

View large format table.

Column type Active phase I Reference Comment
CapillaryC103H2082789.Dumitrescu, Buda, et al., 2000H2, 5. K/min; Phase thickness: 0.25 μm; Tstart: 80. C; Tend: 275. C
CapillaryC103H2082781.Dumitrescu, Buda, et al., 2000H2, 4. K/min; Phase thickness: 0.25 μm; Tstart: 100. C; Tend: 275. C

Normal alkane RI, non-polar column, custom temperature program

View large format table.

Column type Active phase I Reference Comment
CapillaryMethyl Silicone2708.Oda, Yasuhara, et al., 199825. m/0.25 mm/0.25 μm, He; Program: 50 0C (2 min) 20 0C/min -> 160 0C 5 0C/min -> 210 0C 10 0C/min -> 300 0C

Lee's RI, non-polar column, isothermal

View large format table.

Column type Active phase Temperature (C) I Reference Comment
PackedMethyl Silicone260.444.2Shlyakhov, 1984
PackedMethyl Silicone270.442.8Shlyakhov, 1984

Lee's RI, non-polar column, temperature ramp

View large format table.

Column type Active phase I Reference Comment
CapillaryPE-5443.2Jamoussi, Kanzari, et al., 200720. m/0.18 mm/0.18 μm, 50. C @ 1.5 min, 8. K/min; Tend: 345. C
Capillary5 % Phenyl methyl siloxane442.56Skrbic and Onjia, 20062. K/min; Tstart: 50. C; Tend: 250. C
Capillary5 % Phenyl methyl siloxane443.60Skrbic and Onjia, 200680. C @ 2. min, 8. K/min, 300. C @ 10. min
CapillaryHP-5443.19Pedersen, Durant, et al., 200530. m/0.25 mm/0.25 μm, Helium, 50. C @ 1.5 min, 6. K/min, 310. C @ 10. min
CapillaryHP-5444.06Marynowski, Pieta, et al., 200460. m/0.25 mm/0.25 μm, He, 3. K/min; Tstart: 35. C; Tend: 300. C
CapillaryDB-5MS443.05Chen, Keeran, et al., 200230. m/0.25 mm/0.5 μm, 40. C @ 1. min, 4. K/min; Tend: 310. C
CapillaryPTE-5441.79Wang, Jia, et al., 200030. m/0.25 mm/0.25 μm, 60. C @ 1.5 min, 8. K/min, 300. C @ 12.5 min
CapillaryHP-5442.28Piao, Chu, et al., 199930. m/0.25 mm/0.25 μm, 50. C @ 2. min, 4. K/min, 280. C @ 20. min
CapillaryHP-5442.77Piao, Chu, et al., 199930. m/0.25 mm/0.25 μm, 50. C @ 2. min, 4. K/min, 280. C @ 20. min
CapillaryDB-5437.8Durlak, Biswas, et al., 199830. m/0.25 mm/0.25 μm, 15. K/min; Tstart: 50. C; Tend: 300. C
CapillarySE-54443.60Chen, 19964. K/min; Column length: 30. m; Column diameter: 0.25 mm; Tstart: 50. C; Tend: 300. C
CapillarySE-52444.60Shaogang and Xiaobai, 199440. C @ 2. min, 4. K/min, 300. C @ 20. min; Column length: 30. m; Column diameter: 0.25 mm
CapillaryDB-5430.8Donnelly, Abdel-Hamid, et al., 199330. m/0.32 mm/0.25 μm, He, 40. C @ 3. min, 8. K/min, 285. C @ 29.5 min
CapillarySPB-5444.6Knobloch and Engewald, 199340. C @ 2. min, 4. K/min; Column length: 30. m; Column diameter: 0.25 mm; Tend: 300. C
CapillarySE-52442.72Hasegawa, Muragishi, et al., 19883. K/min; Column length: 25. m; Column diameter: 0.25 mm; Tstart: 130. C; Tend: 260. C
CapillaryDB-5444.06Wise, Benner, et al., 198830. m/0.25 mm/0.25 μm, 40. C @ 2. min, 4. K/min, 280. C @ 5. min
CapillaryDB-5440.04Rostad and Pereira, 198630. m/0.26 mm/0.25 μm, He, 50. C @ 4. min, 6. K/min, 300. C @ 20. min
CapillarySE-52444.02Vassilaros, Kong, et al., 198220. m/0.30 mm/0.25 μm, H2, 40. C @ 2. min, 4. K/min; Tend: 265. C
CapillarySE-52442.56Lee, Vassilaros, et al., 197912. m/0.3 mm/0.34 μm, He, 2. K/min; Tstart: 50. C; Tend: 250. C

Lee's RI, non-polar column, custom temperature program

View large format table.

Column type Active phase I Reference Comment
CapillaryDB-5430.6Fuentes, Font, et al., 2007Column length: 60. m; Program: not specified
CapillaryHP-5MS444.65Wang, Li, et al., 200730. m/0.25 mm/0.25 μm, He; Program: 60C(2min) => 6C/min => 258C => 2C/min => 300C(4min)
CapillaryHP-5MS444.02Wang, Li, et al., 2007, 230. m/0.25 mm/0.25 μm, He; Program: not specified
CapillaryHP-5MS444.06Wang, Li, et al., 2007, 230. m/0.25 mm/0.25 μm, He; Program: not specified
CapillaryHP-5MS444.65Wang, Li, et al., 2007, 230. m/0.25 mm/0.25 μm, He; Program: not specified
Capillary5 % Phenyl methyl siloxane442.80Skrbic and Onjia, 2006Program: 70 0C (2 min) 30 0C/min -> 150 0C 5 0C/min -> 200 0C 4 0C/min -> 310 0C (5 min)
CapillaryDB-5MS436.Aracil, Font, et al., 2005Column length: 60. m; Column diameter: 0.25 mm; Program: not specified
CapillaryUltra-1442.6Sremac, Skrbic, et al., 200550. m/0.32 mm/0.50 μm, Nitrogen; Program: 40-100 0C 3-15 0C/min -> 290 0C
CapillaryUltra-1442.8Sremac, Skrbic, et al., 200550. m/0.32 mm/0.50 μm, Nitrogen; Program: 40-100 0C 3-15 0C/min -> 290 0C
CapillaryUltra-1443.6Sremac, Skrbic, et al., 200550. m/0.32 mm/0.50 μm, Nitrogen; Program: 40-100 0C 3-15 0C/min -> 290 0C
CapillaryDB-5442.8Lundstedt, Haglund, et al., 200330. m/0.25 mm/0.25 μm; Program: not specified
CapillaryLM-5441.09Ré-Poppi and Santiago-Silva, 200230. m/0.25 mm/0.25 μm, He; Program: 60C(2min) => 15C/min => 180C => 5C/min => 280C(5min)
CapillaryLM-5441.16Ré-Poppi and Santiago-Silva, 200230. m/0.25 mm/0.25 μm, He; Program: 60C(2min) => 15C/min => 180C => 5C/min => 280C(5min)
CapillaryDB-5443.44Zamperlini, Silva, et al., 199730. m/0.25 mm/0.25 μm, He; Program: 90C (1min) => 10C/min => 120C => 4C/min => 310C (20min)
CapillaryDB-5444.6Zamperlini, Silva, et al., 199730. m/0.25 mm/0.25 μm, He; Program: 90C (1min) => 10C/min => 120C => 4C/min => 310C (20min)
CapillarySE-54442.56Chen, 1996Column length: 30. m; Column diameter: 0.25 mm; Program: not specified
CapillarySE-52444.02Shaogang and Xiaobai, 1994Column length: 30. m; Column diameter: 0.25 mm; Program: not specified
CapillarySE-54444.43Guillen, Iglesias, et al., 1992Program: not specified
CapillarySE-52440.48Shlyakhov, 1984Program: not specified
CapillarySE-52442.56Shlyakhov, 1984Program: not specified

References

Roux, Temprado, et al., 2008
Roux, M.V.; Temprado, M.; Chickos, J.S.; Nagano, Y.,
Critically Evaluated Thermochemical Properties of Polycyclic Aromatic Hydrocarbons,
J. Phys. Chem. Ref. Data, 2008, 37, 4, 1855-1996. [all data]
Dorofeeva O.V., 1989
Dorofeeva O.V.,
Thermodynamic Properties of Gaseous Polycyclic Aromatic Hydrocarbons Containing Five-Membered Rings. Institute for High Temperatures, USSR Academy of Sciences, Preprint No.1-263 (in Russian), Moscow, 1989. [all data]
Dorofeeva O.V., 1986
Dorofeeva O.V.,
On calculation of thermodynamic properties of polycyclic aromatic hydrocarbons,
Thermochim. Acta, 1986, 102, 59-66. [all data]
Moiseeva N.F., 1990
Moiseeva N.F.,
Group additivity scheme for calculating the chemical thermodynamic properties of gaseous polycyclic aromatic hydrocarbons containing five-membered rings,
Thermochim. Acta, 1990, 168, 179-186. [all data]
Frenkel M., 1994
Frenkel M.,
Thermodynamics of Organic Compounds in the Gas State, Vol. I, II, Thermodynamics Research Center, College Station, Texas, 1994, 1994. [all data]
Weast and Grasselli, 1989
CRC Handbook of Data on Organic Compounds, 2nd Editon, Weast,R.C and Grasselli, J.G., ed(s)., CRC Press, Inc., Boca Raton, FL, 1989, 1. [all data]
Buckingham and Donaghy, 1982
Buckingham, J.; Donaghy, S.M.,
Dictionary of Organic Compounds: Fifth Edition, Chapman and Hall, New York, 1982, 1. [all data]
Hanshaw, Nutt, et al., 2008
Hanshaw, William; Nutt, Marjorie; Chickos, James S.,
Hypothetical Thermodynamic Properties. Subcooled Vaporization Enthalpies and Vapor Pressures of Polyaromatic Hydrocarbons,
J. Chem. Eng. Data, 2008, 53, 8, 1903-1913, https://doi.org/10.1021/je800300x
. [all data]
Haftka, Parsons, et al., 2006
Haftka, Joris J.H.; Parsons, John R.; Govers, Harrie A.J.,
Supercooled liquid vapour pressures and related thermodynamic properties of polycyclic aromatic hydrocarbons determined by gas chromatography,
Journal of Chromatography A, 2006, 1135, 1, 91-100, https://doi.org/10.1016/j.chroma.2006.09.050
. [all data]
Diogo and Minas da Piedade, 2002
Diogo, Herminio P.; Minas da Piedade, Manuel E.,
Enthalpy of formation of benzo[k]fluoranthene,
The Journal of Chemical Thermodynamics, 2002, 34, 2, 173-184, https://doi.org/10.1006/jcht.2001.0895
. [all data]
Lei, Chankalal, et al., 2002
Lei, Ying Duan; Chankalal, Raymond; Chan, Anita; Wania, Frank,
Supercooled Liquid Vapor Pressures of the Polycyclic Aromatic Hydrocarbons,
J. Chem. Eng. Data, 2002, 47, 4, 801-806, https://doi.org/10.1021/je0155148
. [all data]
Stephenson and Malanowski, 1987
Stephenson, Richard M.; Malanowski, Stanislaw,
Handbook of the Thermodynamics of Organic Compounds, 1987, https://doi.org/10.1007/978-94-009-3173-2
. [all data]
Kestens, Auclair, et al., 2010
Kestens, Vikram; Auclair, Guy; Drozdzewska, Katarzyna; Held, Andrea; Roebben, Gert; Linsinger, Thomas,
Thermodynamic property values of selected polycyclic aromatic hydrocarbons measured by differential scanning calorimetry,
J Therm Anal Calorim, 2010, 99, 1, 245-261, https://doi.org/10.1007/s10973-009-0440-6
. [all data]