2,4-Dicarbaheptaborane(7)
- Formula: C2H7B5
- Molecular weight: 85.132
- CAS Registry Number: 20693-69-0

Phase change data

Data compiled by: William E. Acree, Jr., James S. Chickos
Enthalpy of vaporization
ΔvapH (kJ/mol) | Temperature (K) | Method | Reference | Comment |
---|---|---|---|---|
31.6 | 288. | I | Shmyreva, Shlyakova, et al., 1976 | Based on data from 273. to 323. K. |

Reaction thermochemistry data

Data compiled by: John E. Bartmess
Individual Reactions
C2H6B5- + = C2H7B5
By formula: C2H6B5- + H+ = C2H7B5
Quantity | Value | Units | Method | Reference | Comment |
---|---|---|---|---|---|
ΔrH° | <452.00 | kcal/mol | EIAE | Onak, Howard, et al., 1973 | gas phase; From closo-2,4-C2B5H7. Computations indicate dHacid ca. 371 kcal/mol |

Gas phase ion energetics data

Data evaluated as indicated in comments:
HL - Edward P. Hunter and Sharon G. Lias
Data compiled as indicated in comments:
B - John E. Bartmess
LLK - Sharon G. Lias, Rhoda D. Levin, and Sherif A. Kafafi
Quantity | Value | Units | Method | Reference | Comment |
---|---|---|---|---|---|
Proton affinity (review) | 166.7 | kcal/mol | N/A | Hunter and Lias, 1998 | HL |
Quantity | Value | Units | Method | Reference | Comment |
Gas basicity | 158.9 | kcal/mol | N/A | Hunter and Lias, 1998 | HL |
Ionization energy determinations
IE (eV) | Method | Reference | Comment |
---|---|---|---|
10.54 | PE | Fehlner, 1975 | LLK |
10.6 | PE | Ulman and Fehlner, 1978 | Vertical value; LLK |
De-protonation reactions
C2H6B5- + = C2H7B5
By formula: C2H6B5- + H+ = C2H7B5
Quantity | Value | Units | Method | Reference | Comment |
---|---|---|---|---|---|
ΔrH° | <452.00 | kcal/mol | EIAE | Onak, Howard, et al., 1973 | gas phase; From closo-2,4-C2B5H7. Computations indicate dHacid ca. 371 kcal/mol; B |

References

Shmyreva, Shlyakova, et al., 1976
Shmyreva, G.O.; Shlyakova, V.G.; Golosova, R.M.; Petrunin, A.B.; Bekker, D.B.; Zhigach, A.F.,
Russ. J. Phys. Chem., 1976, 50, 478. [all data]