Quinoline, 3,6-dimethyl-
- Formula: C11H11N
- Molecular weight: 157.2117
- IUPAC Standard InChIKey: XEDLZYLCKAHYHR-UHFFFAOYSA-N
- CAS Registry Number: 20668-26-2
- Chemical structure:
View 3d structure (requires JavaScript / HTML 5) - Other names: 3,6-dimethylquinoline

Phase change data

Data compiled by: Thermodynamics Research Center, NIST Boulder Laboratories, Chris Muzny director
Quantity | Value | Units | Method | Reference | Comment |
---|---|---|---|---|---|
Tfus | 331. | K | N/A | Manske, Marion, et al., 1942 | Uncertainty assigned by TRC = 4. K |

Kovats' RI, non-polar column, isothermal

View large format table.

Column type Active phase Temperature (C) I Reference Comment
CapillaryOV-101140.1417.Berlizov, Berezkin, et al., 1986N2; Column length: 15. m; Column diameter: 0.20 mm
CapillaryOV-101140.1418.Berlizov, Berezkin, et al., 1986N2; Column length: 15. m; Column diameter: 0.20 mm
CapillaryOV-101140.1420.Berlizov, Berezkin, et al., 1986N2; Column length: 15. m; Column diameter: 0.20 mm
CapillaryOV-101140.1427.Berlizov, Berezkin, et al., 1986N2; Column length: 15. m; Column diameter: 0.20 mm
CapillaryOV-101140.1429.Berlizov, Berezkin, et al., 1986N2; Column length: 15. m; Column diameter: 0.20 mm

References

Manske, Marion, et al., 1942
Manske, R.H.F.; Marion, L.; Leger, F.,
The synthesis and characterization of the monomethyl and dimethylquinolines,
Can. J. Res., Sect. B, 1942, 20, 133-52. [all data]