Oxazole, trimethyl-
- Formula: C6H9NO
- Molecular weight: 111.1418
- IUPAC Standard InChIKey: ZRLDBDZSLLGDOX-UHFFFAOYSA-N
- CAS Registry Number: 20662-84-4
- Chemical structure:
View 3d structure (requires JavaScript / HTML 5) - Other names: Trimethyloxazole; 2,4,5-Trimethyloxazole; Oxazole, 2,4,5-trimethyl

Phase change data

Data compiled by: Robert L. Brown and Stephen E. Stein
Quantity | Value | Units | Method | Reference | Comment |
---|---|---|---|---|---|
Tboil | 406.7 | K | N/A | Aldrich Chemical Company Inc., 1990 |

Normal alkane RI, polar column, temperature ramp

Data compiled by: NIST Mass Spectrometry Data Center, William E. Wallace, director

Column type CapillaryCapillaryCapillaryCapillaryCapillary
Active phase FFAPFFAPDB-WaxDB-WaxHP-Wax
Column length (m) 30.30.30.30.60.
Carrier gas NitrogenN2  He
Substrate
Column diameter (mm) 0.320.320.250.250.25
Phase thickness (μm) 0.500.50.250.250.5
Tstart (C) 35.35.30.30.40.
Tend (C) 250.320.250.250.190.
Heat rate (K/min) 4.4.4.4.3.
Initial hold (min) 5.5.1.1.6.
Final hold (min) 45.45.
I 1209.1209.1200.1204.1214.
ReferenceBudryn, Nebesny, et al., 2011Nebesny, Budryn, et al., 2007Tanaka, Yamauchi, et al., 2003Tanaka, Yamauchi, et al., 2003Sanz, Maeztu, et al., 2002
Comment MSDC-RI MSDC-RI MSDC-RI MSDC-RI MSDC-RI
Column type CapillaryCapillaryCapillaryCapillary
Active phase HP-WaxDB-WaxDB-WaxCarbowax 20M
Column length (m) 60.60.60.39.
Carrier gas HeHeHeH2
Substrate
Column diameter (mm) 0.250.250.250.30
Phase thickness (μm) 0.5
Tstart (C) 40.40.60.60.
Tend (C) 190.200.180.220.
Heat rate (K/min) 3.2.4.2.
Initial hold (min) 6.2.4.
Final hold (min)   30.
I 1214.1197.1211.1190.
ReferenceSanz, Ansorena, et al., 2001Umano, Hagi, et al., 1995Eiserich, Macku, et al., 1992Liardon and Ledermann, 1980
Comment MSDC-RI MSDC-RI MSDC-RI MSDC-RI

Van Den Dool and Kratz RI, polar column, temperature ramp

Data compiled by: NIST Mass Spectrometry Data Center, William E. Wallace, director

Column type CapillaryCapillaryCapillaryCapillaryCapillary
Active phase CP-Wax 52CBSupelcowax-10Supelcowax-10DB-WaxSupelcowax-10
Column length (m) 50.60.60.60.60.
Carrier gas  HeHeHeHe
Substrate
Column diameter (mm) 0.320.250.250.250.25
Phase thickness (μm)  0.250.250.250.25
Tstart (C) 60.35.35.40.35.
Tend (C) 220.195.195.200.195.
Heat rate (K/min) 4.2.2.2.2.
Initial hold (min) 5.5.5.5.5.
Final hold (min) 30.90.90.30.90.
I 1188.1193.1193.1197.1193.
ReferenceMahadevan and Farmer, 2006Chung, Yung, et al., 2002Chung, Yung, et al., 2001Kim, 2001Chung, 1999
Comment MSDC-RI MSDC-RI MSDC-RI MSDC-RI MSDC-RI
Column type CapillaryCapillaryCapillaryCapillary
Active phase DB-WaxDB-WaxSupelcowax-10CP-WAX 57CB
Column length (m) 60.60.60.50.
Carrier gas HeHeHe
Substrate
Column diameter (mm) 0.250.250.250.32
Phase thickness (μm) 0.250.250.25
Tstart (C) 50.50.40.60.
Tend (C) 230.230.195.200.
Heat rate (K/min) 3.2.2.4.
Initial hold (min)   5.5.
Final hold (min)  60.40.
I 1224.1190.1188.1215.
ReferenceShimoda, Peralta, et al., 1996Shimoda, Shiratsuchi, et al., 1996Chung and Cadwallader, 1993Salter L.J., Mottram D.S., et al., 1988
Comment MSDC-RI MSDC-RI MSDC-RI MSDC-RI

References

Aldrich Chemical Company Inc., 1990
Aldrich Chemical Company Inc.,
Catalog Handbook of Fine Chemicals, Aldrich Chemical Company, Inc., Milwaukee WI, 1990, 1. [all data]