Indeno(1,2,3-ij)isoquinoline
- Formula: C15H9N
- Molecular weight: 203.2387
- IUPAC Standard InChIKey: XQNXAFHTOWJFTR-UHFFFAOYSA-N
- CAS Registry Number: 206-56-4
- Chemical structure:
View 3d structure (requires JavaScript / HTML 5) - Other names: 1-Azafluoranthene; Indeno[1.2.3-ij]isoquinoline

Phase change data

Data compiled by: Robert L. Brown and Stephen E. Stein
Quantity | Value | Units | Method | Reference | Comment |
---|---|---|---|---|---|
Tboil | 661. | K | N/A | Buckingham and Donaghy, 1982 | |
Quantity | Value | Units | Method | Reference | Comment |
Tfus | 356. | K | N/A | Buckingham and Donaghy, 1982 |

Lee's RI, non-polar column, temperature ramp

Column type | Active phase | I | Reference | Comment |
---|---|---|---|---|
Capillary | SE-52 | 348.47 | Hasegawa, Usami, et al., 1990 | 2. K/min; Column length: 12. m; Column diameter: 0.25 mm; Tstart: 50. C; Tend: 270. C |
Capillary | SE-52 | 347.57 | Lee, Vassilaros, et al., 1979 | 12. m/0.3 mm/0.34 μm, He, 2. K/min; Tstart: 50. C; Tend: 250. C |

Lee's RI, non-polar column, custom temperature program

Column type | Active phase | I | Reference | Comment |
---|---|---|---|---|
Capillary | SE-52 | 348.17 | Hasegawa, Usami, et al., 1990 | Column length: 12. m; Column diameter: 0.25 mm; Program: not specified |

References

Buckingham and Donaghy, 1982
Buckingham, J.; Donaghy, S.M.,
Dictionary of Organic Compounds: Fifth Edition, Chapman and Hall, New York, 1982, 1. [all data]
Hasegawa, Usami, et al., 1990
Hasegawa, K.; Usami, S.; Higashide, A.,
Analysis of amino polycyclic aromatic hydrocarbons and polycyclic aromatic nitrogen heterocycles,
Nippon Kagaku Kaishi, 1990, 7, 777-788, https://doi.org/10.1246/nikkashi.1990.777
. [all data]
Lee, Vassilaros, et al., 1979
Lee, M.L.; Vassilaros, D.L.; White, C.M.; Novotny, M.,
Retention Indices for Programmed-Temperature Capillary-Column Gas Chromatography of Polycyclic Aromatic Hydrocarbons,
Anal. Chem., 1979, 51, 6, 768-773, https://doi.org/10.1021/ac50042a043
. [all data]