Benzoic acid, 2,6-dimethoxy-, methyl ester
- Formula: C10H12O4
- Molecular weight: 196.1999
- IUPAC Standard InChIKey: XLXVNKPXOIYLLE-UHFFFAOYSA-N
- CAS Registry Number: 2065-27-2
- Chemical structure:
View 3d structure (requires JavaScript / HTML 5) - Other names: Methyl 2,6-dimethoxybenzoate; 2,6-Dihydroxybenzoic acid, dimethyl ether, methyl ester

Van Den Dool and Kratz RI, non-polar column, custom temperature program

Column type | Active phase | I | Reference | Comment |
---|---|---|---|---|
Capillary | VF-5MS | 1536.3 | Tret'yakov, 2008 | 30. m/0.25 mm/0.25 μm, He; Program: Multi-step temperature program; T(initial)=60C; T(final)=270C |

References

Tret'yakov, 2008
Tret'yakov, K.V.,
Retention Data. NIST Mass Spectrometry Data Center., NIST Mass Spectrometry Data Center, 2008. [all data]