Di-N-propylethylamine
- Formula: C8H19N
- Molecular weight: 129.2432
- IUPAC Standard InChIKey: XWCCTMBMQUCLSI-UHFFFAOYSA-N
- CAS Registry Number: 20634-92-8
- Chemical structure:
View 3d structure (requires JavaScript / HTML 5) - Other names: 1-Propanamine, N-ethyl-N-propyl-

Kovats' RI, non-polar column, isothermal

Column type | Active phase | Temperature (C) | I | Reference | Comment |
---|---|---|---|---|---|
Capillary | Apiezon L + KF | 80. | 838. | Svetlova, Samusenko, et al., 1986 | 30. m/0.25 mm/0.06 μm |
Packed | Apiezon L | 80. | 834. | Zhuravleva, Golovnya, et al., 1981 | Chromosorb G AW (80-100 mesh); Column length: 2.7 m |
Packed | Apiezon L | 80. | 836. | Zhuravleva, Golovnya, et al., 1981 | Chromosorb G AW (80-100 mesh); Column length: 2.7 m |

References

Svetlova, Samusenko, et al., 1986
Svetlova, N.I.; Samusenko, A.L.; Golovnya, R.V.,
Advantage of the universal equation over the linear equation for the calculation of retention parameters of homologous series in capillary chromatography,
J. Hi. Res. Chromatogr. Chromatogr. Comm., 1986, 9, 12, 737-740, https://doi.org/10.1002/jhrc.1240091205
. [all data]
Zhuravleva, Golovnya, et al., 1981
Zhuravleva, I.L.; Golovnya, R.V.; Terenina, M.B.; Grigorieva, D.N.,
Gas chromatographic behaviour of some unsymmetrical tertiary amines,
Zh. Anal. Khim., 1981, 36, 968-975. [all data]