Ethanol, 2-(2-hydroxyethoxy)-, 1-nitrate
- Formula: C4H9NO5
- Molecular weight: 151.1180
- IUPAC Standard InChIKey: QRCYUCUXPSBJNO-UHFFFAOYSA-N
- CAS Registry Number: 20633-16-3
- Chemical structure:
View 3d structure (requires JavaScript / HTML 5) - Other names: Diethylene glycol, mononitrate; Ethanol, 2,2'-oxybis-, mononitrate

Reaction thermochemistry data

Data compiled by: Hussein Y. Afeefy, Joel F. Liebman, and Stephen E. Stein
Individual Reactions
By formula: C4H10O3 + HNO3 = C4H9NO5 + H2O
Quantity | Value | Units | Method | Reference | Comment |
---|---|---|---|---|---|
ΔrH° | -11.3 | kJ/mol | Cm | Tsvetkov, Sopin, et al., 1986 | liquid phase |
By formula: C4H10O3 + HNO3 = C4H9NO5 + H2O
Quantity | Value | Units | Method | Reference | Comment |
---|---|---|---|---|---|
ΔrH° | -8.8 | kJ/mol | Cm | Tsvetkov, Sopin, et al., 1986 | liquid phase |

References

Tsvetkov, Sopin, et al., 1986
Tsvetkov, V.G.; Sopin, V.P.; Tsvetkova, L.Ya.; Marchenko, G.N.,
Enthalpy of reaction of nitric acid with some organic compounds,
J. Gen. Chem. USSR, 1986, 56, 471-474. [all data]