1,2-Propanediol, 3,3'-oxydi-, tetranitrate
- Formula: C6H10N4O13
- Molecular weight: 346.1626
- IUPAC Standard InChIKey: SKKBQEZMHMDRLE-UHFFFAOYSA-N
- CAS Registry Number: 20600-96-8
- Chemical structure:
View 3d structure (requires JavaScript / HTML 5) - Other names: Diglycerol tetranitrate; Tetranitro diglycerin

Condensed phase thermochemistry data

Data compiled by: Hussein Y. Afeefy, Joel F. Liebman, and Stephen E. Stein
Quantity | Value | Units | Method | Reference | Comment |
---|---|---|---|---|---|
ΔcH°liquid | -3161.9 | kJ/mol | Ccb | Castronia, 1949 |

References

Castronia, 1949
Castronia, T.C.,
Long range basic research leading to the development of ideal propellants,
Picatinny Arsenal Techn. Rep. No. 1755, 1949, 1. [all data]