C19H12
- Formula: C19H12
- Molecular weight: 240.2986
- CAS Registry Number: 205-94-7

Reaction thermochemistry data

Data compiled by: John E. Bartmess
Individual Reactions
C19H11- + = C19H12
By formula: C19H11- + H+ = C19H12
Quantity | Value | Units | Method | Reference | Comment |
---|---|---|---|---|---|
ΔrH° | 1391. ± 8.8 | kJ/mol | G+TS | Taft and Bordwell, 1988 | gas phase; Acid HOF: 104.7 MMX; 123.4 AM1; 92 G3MP2B3 |
Quantity | Value | Units | Method | Reference | Comment |
ΔrG° | 1359. ± 8.4 | kJ/mol | IMRE | Taft and Bordwell, 1988 | gas phase; Acid HOF: 104.7 MMX; 123.4 AM1; 92 G3MP2B3 |

Gas phase ion energetics data

Data compiled by: John E. Bartmess
De-protonation reactions
C19H11- + = C19H12
By formula: C19H11- + H+ = C19H12
Quantity | Value | Units | Method | Reference | Comment |
---|---|---|---|---|---|
ΔrH° | 1391. ± 8.8 | kJ/mol | G+TS | Taft and Bordwell, 1988 | gas phase; Acid HOF: 104.7 MMX; 123.4 AM1; 92 G3MP2B3 |
Quantity | Value | Units | Method | Reference | Comment |
ΔrG° | 1359. ± 8.4 | kJ/mol | IMRE | Taft and Bordwell, 1988 | gas phase; Acid HOF: 104.7 MMX; 123.4 AM1; 92 G3MP2B3 |

References

Taft and Bordwell, 1988
Taft, R.W.; Bordwell, F.G.,
Structural and Solvent Effects Evaluated from Acidities Measured in Dimethyl Sulfoxide and in the Gas Phase,
Acc. Chem. Res., 1988, 21, 12, 463, https://doi.org/10.1021/ar00156a005
. [all data]