Benzo[j]fluoranthene
- Formula: C20H12
- Molecular weight: 252.3093
- IUPAC Standard InChIKey: KHNYNFUTFKJLDD-UHFFFAOYSA-N
- CAS Registry Number: 205-82-3
- Chemical structure:
View 3d structure (requires JavaScript / HTML 5) - Other names: Benzo[l]fluoranthene; Dibenzo[a,jk]fluorene; Benz(j)fluoranthene; 7,8-Benzofluoranthene; B(j)F

Phase change data

Data compiled by: William E. Acree, Jr., James S. Chickos
Enthalpy of fusion
ΔfusH (kJ/mol) | Temperature (K) | Method | Reference |
---|---|---|---|
17.9 | 438.3 | DSC | Kestens, Auclair, et al., 2010 |

Kovats' RI, non-polar column, isothermal

Column type | Active phase | Temperature (C) | I | Reference | Comment |
---|---|---|---|---|---|
Capillary | OV-101 | 270. | 2756. | Grimmer and Böhnke, 1972 | N2; Column length: 50. m; Column diameter: 0.50 mm |

Van Den Dool and Kratz RI, non-polar column, custom temperature program

Column type | Active phase | I | Reference | Comment |
---|---|---|---|---|
Capillary | Methyl Silicone | 2711. | Oda, Ichikawa, et al., 1996 | Program: 50C (2min) => 20C/min => 160C => 5C/min => 210C => 10C/min => 300C |
Capillary | Methyl Silicone | 2725. | Oda, Ichikawa, et al., 1996 | Program: 50C (2min) => 20C/min => 160C => 5C/min => 210C => 10C/min => 300C |

Normal alkane RI, non-polar column, custom temperature program

Column type | Active phase | I | Reference | Comment |
---|---|---|---|---|
Capillary | Methyl Silicone | 2704. | Oda, Yasuhara, et al., 1998 | 25. m/0.25 mm/0.25 μm, He; Program: 50 0C (2 min) 20 0C/min -> 160 0C 5 0C/min -> 210 0C 10 0C/min -> 300 0C |

Lee's RI, non-polar column, temperature ramp

Column type | Active phase | I | Reference | Comment |
---|---|---|---|---|
Capillary | 5 % Phenyl methyl siloxane | 440.92 | Skrbic and Onjia, 2006 | 2. K/min; Tstart: 50. C; Tend: 250. C |
Capillary | HP-5 | 443.19 | Pedersen, Durant, et al., 2005 | 30. m/0.25 mm/0.25 μm, Helium, 50. C @ 1.5 min, 6. K/min, 310. C @ 10. min |
Capillary | HP-5 | 444.06 | Marynowski, Pieta, et al., 2004 | 60. m/0.25 mm/0.25 μm, He, 3. K/min; Tstart: 35. C; Tend: 300. C |
Capillary | DB-5MS | 442.45 | Chen, Keeran, et al., 2002 | 30. m/0.25 mm/0.5 μm, 40. C @ 1. min, 4. K/min; Tend: 310. C |
Capillary | DB-5 | 432.9 | Durlak, Biswas, et al., 1998 | 30. m/0.25 mm/0.25 μm, 15. K/min; Tstart: 50. C; Tend: 300. C |
Capillary | DB-5 | 432.9 | Durlak, Biswas, et al., 1998 | 30. m/0.25 mm/0.25 μm, 15. K/min; Tstart: 50. C; Tend: 300. C |
Capillary | SE-54 | 441.95 | Chen, 1996 | 4. K/min; Column length: 30. m; Column diameter: 0.25 mm; Tstart: 50. C; Tend: 300. C |
Capillary | DB-5 | 443.64 | Wise, Benner, et al., 1988 | 30. m/0.25 mm/0.25 μm, 40. C @ 2. min, 4. K/min, 280. C @ 5. min |
Capillary | SE-52 | 443.13 | Vassilaros, Kong, et al., 1982 | 20. m/0.30 mm/0.25 μm, H2, 40. C @ 2. min, 4. K/min; Tend: 265. C |
Capillary | SE-52 | 440.92 | Lee, Vassilaros, et al., 1979 | 12. m/0.3 mm/0.34 μm, He, 2. K/min; Tstart: 50. C; Tend: 250. C |

Lee's RI, non-polar column, custom temperature program

Column type | Active phase | I | Reference | Comment |
---|---|---|---|---|
Capillary | DB-5 | 430.6 | Fuentes, Font, et al., 2007 | Column length: 60. m; Program: not specified |
Capillary | Ultra-1 | 440.9 | Sremac, Skrbic, et al., 2005 | 50. m/0.32 mm/0.50 μm, Nitrogen; Program: 40-100 0C 3-15 0C/min -> 290 0C |
Capillary | DB-5 | 442.35 | Zamperlini, Silva, et al., 1997 | 30. m/0.25 mm/0.25 μm, He; Program: 90C (1min) => 10C/min => 120C => 4C/min => 310C (20min) |
Capillary | SE-54 | 440.92 | Chen, 1996 | Column length: 30. m; Column diameter: 0.25 mm; Program: not specified |
Capillary | SE-54 | 440.92 | Guillen, Iglesias, et al., 1992 | Program: not specified |
Capillary | SE-52 | 440.92 | Shlyakhov, 1984 | Program: not specified |

References

Kestens, Auclair, et al., 2010
Kestens, Vikram; Auclair, Guy; Drozdzewska, Katarzyna; Held, Andrea; Roebben, Gert; Linsinger, Thomas,
Thermodynamic property values of selected polycyclic aromatic hydrocarbons measured by differential scanning calorimetry,
J Therm Anal Calorim, 2010, 99, 1, 245-261, https://doi.org/10.1007/s10973-009-0440-6
. [all data]
Grimmer and Böhnke, 1972
Grimmer, G.; Böhnke, H.,
Bestimmung des Gesamtgehaltes aller polycyclischen aromatischen Kohlenwasserstoffe in Luftstaub und Kraftfahrzeugabgas mit der Capillar-Gas-Chromatographie,
Z. Anal. Chem., 1972, 261, 4-5, 310-314, https://doi.org/10.1007/BF00786987
. [all data]
Oda, Ichikawa, et al., 1996
Oda, J.; Ichikawa, S.; Mori, T.,
Analysis of polycyclic aromatic hydrocarbons in airborne particulates by capillary GC/MS method with programmed temperature relative retention index,
Bunseki Kagaku, 1996, 45, 9, 825-835, https://doi.org/10.2116/bunsekikagaku.45.825
. [all data]
Oda, Yasuhara, et al., 1998
Oda, J.; Yasuhara, A.; Matsunaga, K.; Saito, Y.,
Identification of polycyclic aromatic hydrocarbons of the particulate accumulated in the tunnel duct of freeway and generation of their oxygenated derivatives,
Jpn. J. Toxicol. Environ. Health, 1998, 44, 5, 334-351, https://doi.org/10.1248/jhs1956.44.334
. [all data]
Skrbic and Onjia, 2006
Skrbic, B.; Onjia, A.,
Prediction of Lee Retention Indices of Polycyclic Aromatic Hydrocarbons by Artificial Neural Networks,
J. Chromatorg. A, 2006, 1108, 2, 279-284, https://doi.org/10.1016/j.chroma.2006.01.080
. [all data]
Pedersen, Durant, et al., 2005
Pedersen, D.U.; Durant, J.L.; Taghizadeh, K.; Hemond, H.F.; Lafleur, A.L.; Cass, G.R.,
Human cell mutagenes in respirable airborne particles from the Northeastern United States. 2. Quantification of mutagenes and other organic compounds.,
Environ. Sci. Technol., 2005, 39, 24, 9547-9560, https://doi.org/10.1021/es050886c
. [all data]
Marynowski, Pieta, et al., 2004
Marynowski, L.; Pieta, M.; Janeczek, J.,
Composition and source of polycyclic aromatic compounds in deposited dust from selected sites around the Upper Silesia, Poland,
Geol. Q., 2004, 48, 2, 169-180. [all data]
Chen, Keeran, et al., 2002
Chen, P.H.; Keeran, W.S.; Van Ausdale, W.A.; Schindler, D.R.; Roberts, D.W.,
Application of Lee retention indices to the confirmation of tentatively identified compounds from GC/MS analysis of environmental samples, Technical paper, Analytical Services Division, Environmental ScienceEngineering, Inc, PO Box 1703, Gainesville, FL 32602, 2002, 11. [all data]
Durlak, Biswas, et al., 1998
Durlak, S.K.; Biswas, P.; Shi, J.; Bernhard, M.J.,
Characterization of polycyclic aromatic hydrocarbon particulate and gaseous emissions from polystyrene combustion,
Environ. Sci. Technol., 1998, 32, 15, 2301-2307, https://doi.org/10.1021/es9709031
. [all data]
Chen, 1996
Chen, J.,
GC and GC/MS methods for the analysis of polycyclic aromatic hydrocarbon (PAH) in sediment of the grand canal of China,
Toxicol. Environ. Chem., 1996, 54, 1-4, 69-73, https://doi.org/10.1080/02772249609358297
. [all data]
Wise, Benner, et al., 1988
Wise, S.A.; Benner, B.A.; Byrd, G.D.; Chesler, S.N.; Rebbert, R.E.; Schantz, M.M.,
Determination of polycyclic aromatic hydrocarbons in a coal tar standard reference material,
Anal. Chem., 1988, 60, 9, 887-894, https://doi.org/10.1021/ac00160a012
. [all data]
Vassilaros, Kong, et al., 1982
Vassilaros, D.L.; Kong, R.C.; Later, D.W.; Lee, M.L.,
Linear retention index system for polycyclic aromatic compounds. Critical evaluation and additional indices,
J. Chromatogr., 1982, 252, 1-20, https://doi.org/10.1016/S0021-9673(01)88394-1
. [all data]
Lee, Vassilaros, et al., 1979
Lee, M.L.; Vassilaros, D.L.; White, C.M.; Novotny, M.,
Retention Indices for Programmed-Temperature Capillary-Column Gas Chromatography of Polycyclic Aromatic Hydrocarbons,
Anal. Chem., 1979, 51, 6, 768-773, https://doi.org/10.1021/ac50042a043
. [all data]
Fuentes, Font, et al., 2007
Fuentes, M.J.; Font, R.; Gomez-Rico, M.F.; Martin-Gullon, I.,
Pyrolysis and combustion of waste lubricant oil from diesel cars: Decomposition and pollutants,
J. Anal. Appl. Pyrolysis, 2007, 79, 1-2, 215-226, https://doi.org/10.1016/j.jaap.2006.12.004
. [all data]
Sremac, Skrbic, et al., 2005
Sremac, S.; Skrbic, B.; Onjia, A.,
Artificial neural network prediction of quantitative structure-retention relationships of polycyclic aromatic hydrocarbons in gas chromatography,
J. Serb. Chem. Soc., 2005, 70, 11, 1291-1300, https://doi.org/10.2298/JSC0511291S
. [all data]
Zamperlini, Silva, et al., 1997
Zamperlini, G.C.M.; Silva, M.R.S.; Vilegas, W.,
Identification of polycyclic aromatic hydrocarbons in sugar cane soot by gas chromatography-mass spectrometry,
Chromatographia, 1997, 46, 11/12, 655-663, https://doi.org/10.1007/BF02490527
. [all data]
Guillen, Iglesias, et al., 1992
Guillen, M.D.; Iglesias, M.J.; Dominguez, A.; Blanco, C.G.,
Polynuclear aromatic hydrocarbon retention indices on SE-54 stationary phase of the volatile components of a coal tar pitch. Relationships between chromatographic retention and thermal reactivity,
J. Chromatogr., 1992, 591, 1-2, 287-295, https://doi.org/10.1016/0021-9673(92)80246-Q
. [all data]
Shlyakhov, 1984
Shlyakhov, A.F.,
Gas chromatography in organic geochemistry, Nedra, Moscow, 1984, 221. [all data]