Propylamine, N-ethylidene-
- Formula: C5H11N
- Molecular weight: 85.1475
- IUPAC Standard InChIKey: FBXWQCRRTFRZDA-GQCTYLIASA-N
- CAS Registry Number: 20577-33-7
- Chemical structure:
View 3d structure (requires JavaScript / HTML 5) - Permanent link for this species. Use this link for bookmarking this species for future reference.

Reaction thermochemistry data

Data compiled by: Hussein Y. Afeefy, Joel F. Liebman, and Stephen E. Stein
Individual Reactions
By formula: H2 + C5H11N = C5H13N
Quantity | Value | Units | Method | Reference | Comment |
---|---|---|---|---|---|
ΔrH° | 89. ± 2. | kJ/mol | Chyd | Jackman and Packham, 1957 | liquid phase; solvent: bis-2-Ethoxyethyl ether |

References

Jackman and Packham, 1957
Jackman, L.M.; Packham, D.I.,
The experimental resonance energy of acridine,
Proc. Chem. Soc., London, 1957, 349-350. [all data]