trans-2,3-Dimethyl-bicyclo[2.2.1]heptane

Condensed phase thermochemistry data

Data compiled by: Hussein Y. Afeefy, Joel F. Liebman, and Stephen E. Stein

Quantity Value Units Method Reference Comment
Δfliquid-150.2 ± 2.1kJ/molCcbKozina, Timofeeva, et al., 1971
Quantity Value Units Method Reference Comment
Δcliquid-5678.0 ± 2.1kJ/molCcbKozina, Timofeeva, et al., 1971Corresponding Δfliquid = -150.2 kJ/mol (simple calculation by NIST; no Washburn corrections)

References

Kozina, Timofeeva, et al., 1971
Kozina, M.P.; Timofeeva, L.P.; Skuratov, S.M.; Belikova, N.A.; Milvitskaya, E.M.; Plate, A.F., The enthalpies of combustion of some bicyclic compounds, J. Chem. Thermodyn., 1971, 3, 563-570. [all data]