9,9'-Biphenanthrene
- Formula: C28H18
- Molecular weight: 354.4425
- IUPAC Standard InChIKey: UPAPZXUZBAAZCB-UHFFFAOYSA-N
- CAS Registry Number: 20532-03-0
- Chemical structure:
View 3d structure (requires JavaScript / HTML 5) - Other names: 9,9'-Biphenanthryl

Phase change data

Data compiled as indicated in comments:
DRB - Donald R. Burgess, Jr.
ALS - Hussein Y. Afeefy, Joel F. Liebman, and Stephen E. Stein
Quantity | Value | Units | Method | Reference | Comment |
---|---|---|---|---|---|
ΔsubH° | 151.5 | kJ/mol | Review | Roux, Temprado, et al., 2008 | There are insufficient literature values to properly evaluated the data and measurements are of low quality and/or there is substantial disagreement with values predicted using thermochemical cycles or estimation methods (trends).; DRB |
Enthalpy of sublimation
ΔsubH (kJ/mol) | Temperature (K) | Method | Reference | Comment |
---|---|---|---|---|
151. | 293. | V | Magnus, Hartmann, et al., 1951 | ALS |

Gas phase thermochemistry data

Data compiled by: Donald R. Burgess, Jr.

Quantity Value Units Method Reference Comment
Δfgas87.0kcal/molReviewRoux, Temprado, et al., 2008There are insufficient literature values to properly evaluate the data and insufficient information to construct thermochemical cycles or estimate values for comparison, and one must rely solely upon reported uncertainities and the quality of the measurements. In general, the evaluated uncertainty limits are on the order of (3 to 9) kJ/mol.

References

Roux, Temprado, et al., 2008
Roux, M.V.; Temprado, M.; Chickos, J.S.; Nagano, Y.,
Critically Evaluated Thermochemical Properties of Polycyclic Aromatic Hydrocarbons,
J. Phys. Chem. Ref. Data, 2008, 37, 4, 1855-1996. [all data]
Magnus, Hartmann, et al., 1951
Magnus, A.; Hartmann, H.; Becker, F.,
Verbrennungswarmen und resonanzenergien von mehrkernigen aromatischen kohlenwasserstoffen,
Z. Phys. Chem., 1951, 197, 75-91. [all data]