1,11-Dodecadiyne
- Formula: C12H18
- Molecular weight: 162.2713
- IUPAC Standard InChIKey: DVVJEEGECYXPEC-UHFFFAOYSA-N
- CAS Registry Number: 20521-44-2
- Chemical structure:
View 3d structure (requires JavaScript / HTML 5) - Permanent link for this species. Use this link for bookmarking this species for future reference.

Phase change data

Data compiled by: Robert L. Brown and Stephen E. Stein
Reduced pressure boiling point
Tboil (K) | Pressure (bar) | Reference |
---|---|---|
372. | 0.020 | Farchan Laboratories, 1990 |

References

Farchan Laboratories, 1990
Farchan Laboratories,
Research Chemicals Catalog, Farchan Laboratories, Gainesville, FL, 1990, 91. [all data]