1,1'-Biphenyl, 2-bromo-
- Formula: C12H9Br
- Molecular weight: 233.104
- IUPAC Standard InChIKey: KTADSLDAUJLZGL-UHFFFAOYSA-N
- CAS Registry Number: 2052-07-5
- Chemical structure:
View 3d structure (requires JavaScript / HTML 5) - Species with the same structure:
- Other names: 2-Bromobiphenyl; 2-Bromodiphenyl; o-Bromobiphenyl; Biphenyl, 2-bromo-

Phase change data

Data compiled by: Robert L. Brown and Stephen E. Stein
Quantity | Value | Units | Method | Reference | Comment |
---|---|---|---|---|---|
Tboil | 570.2 | K | N/A | Weast and Grasselli, 1989 | |
Tboil | 569. to 571. | K | N/A | Buckingham and Donaghy, 1982 |
Reduced pressure boiling point
Tboil (K) | Pressure (bar) | Reference |
---|---|---|
387. | 0.003 | Buckingham and Donaghy, 1982 |

References

Weast and Grasselli, 1989
CRC Handbook of Data on Organic Compounds, 2nd Editon, Weast,R.C and Grasselli, J.G., ed(s)., CRC Press, Inc., Boca Raton, FL, 1989, 1. [all data]
Buckingham and Donaghy, 1982
Buckingham, J.; Donaghy, S.M.,
Dictionary of Organic Compounds: Fifth Edition, Chapman and Hall, New York, 1982, 1. [all data]