Acenaphthylene, 5-bromo-1,2-dihydro-
- Formula: C12H9Br
- Molecular weight: 233.104
- IUPAC Standard InChIKey: QALKJGMGKYKMKE-UHFFFAOYSA-N
- CAS Registry Number: 2051-98-1
- Chemical structure:
View 3d structure (requires JavaScript / HTML 5) - Other names: Acenaphthene, 5-bromo-; 5-Bromoacenaphthene

Phase change data

Data compiled as indicated in comments:
BS - Robert L. Brown and Stephen E. Stein
AC - William E. Acree, Jr., James S. Chickos
Quantity | Value | Units | Method | Reference | Comment |
---|---|---|---|---|---|
Tboil | 608.2 | K | N/A | Weast and Grasselli, 1989 | BS |
Tboil | 608. to 609. | K | N/A | Buckingham and Donaghy, 1982 | BS |
Reduced pressure boiling point
Tboil (K) | Pressure (bar) | Reference | Comment |
---|---|---|---|
458. to 463. | 0.025 | Buckingham and Donaghy, 1982 | BS |
Enthalpy of sublimation
ΔsubH (kJ/mol) | Temperature (K) | Method | Reference | Comment |
---|---|---|---|---|
87.4 ± 2.6 | 295. to 321. | ME | Goldfarb and Suuberg, 2008 | AC |

References

Weast and Grasselli, 1989
CRC Handbook of Data on Organic Compounds, 2nd Editon, Weast,R.C and Grasselli, J.G., ed(s)., CRC Press, Inc., Boca Raton, FL, 1989, 1. [all data]
Buckingham and Donaghy, 1982
Buckingham, J.; Donaghy, S.M.,
Dictionary of Organic Compounds: Fifth Edition, Chapman and Hall, New York, 1982, 1. [all data]
Goldfarb and Suuberg, 2008
Goldfarb, Jillian L.; Suuberg, Eric M.,
The effect of halogen hetero-atoms on the vapor pressures and thermodynamics of polycyclic aromatic compounds measured via the Knudsen effusion technique,
The Journal of Chemical Thermodynamics, 2008, 40, 3, 460-466, https://doi.org/10.1016/j.jct.2007.09.006
. [all data]