Benzene, 1,1'-(dichloromethylene)bis-
- Formula: C13H10Cl2
- Molecular weight: 237.124
- IUPAC Standard InChIKey: OPTDDWCXQQYKGU-UHFFFAOYSA-N
- CAS Registry Number: 2051-90-3
- Chemical structure:
View 3d structure (requires JavaScript / HTML 5) - Other names: Methane, dichlorodiphenyl-; (Dichloro)diphenylmethane; Benzophenone dichloride; Diphenyldichloromethane; DPM; DPM (Halocarbon); α,α-Dichlorodiphenylmethane; NSC 37425

Phase change data

Data compiled by: Robert L. Brown and Stephen E. Stein
Quantity | Value | Units | Method | Reference | Comment |
---|---|---|---|---|---|
Tboil | 578.2 | K | N/A | Aldrich Chemical Company Inc., 1990 |
Reduced pressure boiling point
Tboil (K) | Pressure (bar) | Reference |
---|---|---|
447. | 0.024 | Frinton Laboratories Inc., 1986 |

References

Aldrich Chemical Company Inc., 1990
Aldrich Chemical Company Inc.,
Catalog Handbook of Fine Chemicals, Aldrich Chemical Company, Inc., Milwaukee WI, 1990, 1. [all data]
Frinton Laboratories Inc., 1986
Frinton Laboratories Inc.,
Catalog Number 11, Frinton Laboratories Inc., Vineland, NJ, 1986, 99. [all data]