4-Decanol
- Formula: C10H22O
- Molecular weight: 158.2811
- IUPAC Standard InChIKey: DTDMYWXTWWFLGJ-UHFFFAOYSA-N
- CAS Registry Number: 2051-31-2
- Chemical structure:

Phase change data

Data compiled as indicated in comments:
BS - Robert L. Brown and Stephen E. Stein
TRC - Thermodynamics Research Center, NIST Boulder Laboratories, Chris Muzny director
Quantity | Value | Units | Method | Reference | Comment |
---|---|---|---|---|---|
Tboil | 483.7 | K | N/A | Weast and Grasselli, 1989 | BS |
Quantity | Value | Units | Method | Reference | Comment |
Tc | 664. ± 1. | K | N/A | Gude and Teja, 1995 | |
Tc | 663.7 | K | N/A | Teja, Lee, et al., 1989 | TRC |
Tc | 633.72 | K | N/A | Anselme and Teja, 1988 | Uncertainty assigned by TRC = 0.3 K; TRC |
Quantity | Value | Units | Method | Reference | Comment |
Vc | 0.643 | l/mol | N/A | Gude and Teja, 1995 | |
Quantity | Value | Units | Method | Reference | Comment |
ρc | 1.55 | mol/l | N/A | Gude and Teja, 1995 | |
ρc | 1.55 | mol/l | N/A | Anselme and Teja, 1988 | Uncertainty assigned by TRC = 0.04 mol/l; TRC |

Kovats' RI, non-polar column, isothermal

Column type | Active phase | Temperature (C) | I | Reference | Comment |
---|---|---|---|---|---|
Packed | SE-30 | 150. | 1182. | Bierl, Beroza, et al., 1972 | Column length: 3.0 m |

Kovats' RI, polar column, isothermal

Column type | Active phase | Temperature (C) | I | Reference | Comment |
---|---|---|---|---|---|
Packed | Carbowax 20M | 130. | 1545. | Singliar, 1972 | Column length: 2.55 m |
Packed | Carbowax 20M | 165. | 1544. | Singliar, 1972 | Column length: 2.55 m |

Van Den Dool and Kratz RI, polar column, custom temperature program

Column type | Active phase | I | Reference | Comment |
---|---|---|---|---|
Capillary | CP-Wax 52CB | 1581. | Romeo, Ziino, et al., 2007 | 60. m/0.25 mm/0.25 μm, He; Program: 45C(5min) => 10C/min => 80C => 2C/min => 240C |

Normal alkane RI, polar column, custom temperature program

Column type | Active phase | I | Reference | Comment |
---|---|---|---|---|
Capillary | PEG-20M | 1574. | Qin, 2009 | Program: not specified |

References

Weast and Grasselli, 1989
CRC Handbook of Data on Organic Compounds, 2nd Editon, Weast,R.C and Grasselli, J.G., ed(s)., CRC Press, Inc., Boca Raton, FL, 1989, 1. [all data]
Gude and Teja, 1995
Gude, M.; Teja, A.S.,
Vapor-Liquid Critical Properties of Elements and Compounds. 4. Aliphatic Alkanols,
J. Chem. Eng. Data, 1995, 40, 1025-1036. [all data]
Teja, Lee, et al., 1989
Teja, A.S.; Lee, R.J.; Rosenthal, D.J.; Anselme, M.J.,
Correlation of the Critical Properties of Alkanes and Alkanols
in 5th IUPAC Conference on Alkanes and AlkanolsGradisca, 1989. [all data]
Anselme and Teja, 1988
Anselme, M.J.; Teja, A.S.,
Critical Temperatures and Densities of Isomeric Alkanols with Six to Ten Carbon Atoms,
Fluid Phase Equilib., 1988, 40, 127-34. [all data]
Bierl, Beroza, et al., 1972
Bierl, B.A.; Beroza, M.; Aldridge, M.H.,
Effect of functional-group position on retention indices of six classes of compounds on four stationary phases,
J. Chromatogr. Sci., 1972, 10, 12, 712-715, https://doi.org/10.1093/chromsci/10.12.712
. [all data]
Singliar, 1972
Singliar, M.,
Chromatographic Behaviour and the Structure of Secondary Aliphatic Alcohols,
J. Chromatogr., 1972, 65, 1, 311-321, https://doi.org/10.1016/S0021-9673(00)86946-0
. [all data]
Romeo, Ziino, et al., 2007
Romeo, V.; Ziino, M.; Giuffrrida, D.; Condurso, C.; Verzera, A.,
Flavour profile of capers (Capparis spinosa L.) from the Eolian Archipelago by HS-SPME/GC?MS,
Food Chem., 2007, 101, 3, 1272-1278, https://doi.org/10.1016/j.foodchem.2005.12.029
. [all data]
Qin, 2009
Qin, Z.,
Relationship between the molecular structure and gas chromatographic retention index of alcohol isomer,
J. Xuzhou Norm. Univ. (Nat. Sci. Edn.), 2009, 27, 2, 88-90. [all data]