Quinoline, decahydro-
- Formula: C9H17N
- Molecular weight: 139.2380
- IUPAC Standard InChIKey: POTIYWUALSJREP-UHFFFAOYSA-N
- CAS Registry Number: 2051-28-7
- Chemical structure:
View 3d structure (requires JavaScript / HTML 5) - Stereoisomers:
- Other names: Decahydroquinoline; 2-Azabicyclo[4.4.0]decane

Phase change data

Data compiled by: Robert L. Brown and Stephen E. Stein
Reduced pressure boiling point
Tboil (K) | Pressure (bar) | Reference |
---|---|---|
368. to 372. | 0.027 | Frinton Laboratories Inc., 1986 |

References

Frinton Laboratories Inc., 1986
Frinton Laboratories Inc.,
Catalog Number 11, Frinton Laboratories Inc., Vineland, NJ, 1986, 99. [all data]