Decachlorobiphenyl
- Formula: C12Cl10
- Molecular weight: 498.658
- IUPAC Standard InChIKey: ONXPZLFXDMAPRO-UHFFFAOYSA-N
- CAS Registry Number: 2051-24-3
- Chemical structure:
View 3d structure (requires JavaScript / HTML 5) - Other names: 1,1'-Biphenyl, 2,2',3,3',4,4',5,5',6,6'-decachloro-; Biphenyl, decachloro-; Perchlorobiphenyl; 2,2',3,3',4,4', 5,5',6,6'-Decachlorobiphenyl; 2,2',3,3',4,4',5,5',6,6'-Decachloro-1,1'-biphenyl; Dcb; Pcb 209; decachloro-1,1'-biphenyl

Condensed phase thermochemistry data

Data compiled by: Eugene S. Domalski and Elizabeth D. Hearing
Quantity | Value | Units | Method | Reference | Comment |
---|---|---|---|---|---|
S°solid,1 bar | 108.9 | cal/mol*K | N/A | Saito, Atake, et al., 1987 |
Constant pressure heat capacity of solid
Cp,solid (cal/mol*K) | Temperature (K) | Reference | Comment |
---|---|---|---|
82.22 | 298.15 | Saito, Atake, et al., 1987 | T = 3 to 300 K. |

Phase change data

Data compiled as indicated in comments:
TRC - Thermodynamics Research Center, NIST Boulder Laboratories, Chris Muzny director
AC - William E. Acree, Jr., James S. Chickos
Quantity | Value | Units | Method | Reference | Comment |
---|---|---|---|---|---|
Tfus | 580.66 | K | N/A | Donnelly, Drewes, et al., 1990 | Uncertainty assigned by TRC = 0.2 K; TRC |
Tfus | 578.9 | K | N/A | Miller, Ghodbane, et al., 1984 | Uncertainty assigned by TRC = 0.2 K; TRC |
Tfus | 577.65 | K | N/A | Rybicky and Marton, 1974 | Uncertainty assigned by TRC = 2. K; TRC |
Enthalpy of vaporization
ΔvapH (kcal/mol) | Temperature (K) | Method | Reference | Comment |
---|---|---|---|---|
24.71 | 368. | GC | Falconer and Bidleman, 1994 | Based on data from 343. to 393. K.; AC |
24.71 | 398. | GC | Hinckley, Bidleman, et al., 1990 | Based on data from 343. to 453. K.; AC |
Enthalpy of sublimation
ΔsubH (kcal/mol) | Temperature (K) | Method | Reference | Comment |
---|---|---|---|---|
29.11 | 343. | GS | Burkhard, Armstrong, et al., 1984 | Based on data from 324. to 363. K.; AC |
Enthalpy of fusion
ΔfusH (kcal/mol) | Temperature (K) | Method | Reference | Comment |
---|---|---|---|---|
9.402 | 577.7 | N/A | Acree, 1991 | AC |
9.85 | 580.3 | DSC | Donnelly, Drewes, et al., 1990, 2 | AC |

Lee's RI, non-polar column, temperature ramp

Column type | Active phase | I | Reference | Comment |
---|---|---|---|---|
Capillary | DB-5 | 460.183 | Tong, Shore, et al., 1984 | He, 80. C @ 1. min, 3. K/min, 300. C @ 10. min; Column length: 30. m; Column diameter: 0.32 mm |

References

Saito, Atake, et al., 1987
Saito, K.; Atake, T.; Chihara, H.,
Perfluorobiphenyl and perchlorobiphenyl: heat capacities and intramolecular twisting vibrations,
J. Chem. Thermodynam., 1987, 19, 9-18. [all data]
Donnelly, Drewes, et al., 1990
Donnelly, J.R.; Drewes, L.A.; Johnson, R.L.; Munslow, W.D.; Knapp, K.K.; Sovocool, G.W.,
Purity and heat of fusion data for environmental standards as determined by differential scanning calorimetry,
Thermochim. Acta, 1990, 167, 2, 155, https://doi.org/10.1016/0040-6031(90)80476-F
. [all data]
Miller, Ghodbane, et al., 1984
Miller, M.M.; Ghodbane, S.; Wasik, S.P.; Tewari, Y.B.; Martire, D.E.,
Aqueous Solubilities, Octanol/Water Partition Coefficients, and Entropies of Melting of Chlorinated Benzenes and Biphenyls,
J. Chem. Eng. Data, 1984, 29, 184-190. [all data]
Rybicky and Marton, 1974
Rybicky, J.; Marton, J.P.,
Thermal Characterization of Decachlorobiphenyl,
Thermochim. Acta, 1974, 9, 450. [all data]
Falconer and Bidleman, 1994
Falconer, Renee L.; Bidleman, Terry F.,
Vapor pressures and predicted particle/gas distributions of polychlorinated biphenyl congeners as functions of temperature and ortho-chlorine substitution,
Atmospheric Environment, 1994, 28, 3, 547-554, https://doi.org/10.1016/1352-2310(94)90130-9
. [all data]
Hinckley, Bidleman, et al., 1990
Hinckley, Daniel A.; Bidleman, Terry F.; Foreman, William T.; Tuschall, Jack R.,
Determination of vapor pressures for nonpolar and semipolar organic compounds from gas chromatograhic retention data,
J. Chem. Eng. Data, 1990, 35, 3, 232-237, https://doi.org/10.1021/je00061a003
. [all data]
Burkhard, Armstrong, et al., 1984
Burkhard, L.P.; Armstrong, D.E.; Andren, A.W.,
Vapor pressures for biphenyl, 4-chlorobiphenyl, 2,2',3,3',5,5',6,6'-octachlorobiphenyl, and decachlorobiphenyl,
J. Chem. Eng. Data, 1984, 29, 3, 248-250, https://doi.org/10.1021/je00037a006
. [all data]
Acree, 1991
Acree, William E.,
Thermodynamic properties of organic compounds: enthalpy of fusion and melting point temperature compilation,
Thermochimica Acta, 1991, 189, 1, 37-56, https://doi.org/10.1016/0040-6031(91)87098-H
. [all data]
Donnelly, Drewes, et al., 1990, 2
Donnelly, J.R.; Drewes, L.A.; Johnson, R.L.; Munslow, W.D.; Knapp, K.K.; Sovocool, G.W.,
Purity and heat of fusion data for environmental standards as determined by differential scanning calorimetry,
Thermochimica Acta, 1990, 167, 2, 155-187, https://doi.org/10.1016/0040-6031(90)80476-F
. [all data]
Tong, Shore, et al., 1984
Tong, H.Y.; Shore, D.L.; Karasek, F.W.; Helland, P.; Jellum, E.,
Identification of organic compounds obtained from incineration of municipal waste by high-performance liquid chromatographic fractionation and gas chromatography-mass spectrometry,
J. Chromatogr., 1984, 285, 423-441, https://doi.org/10.1016/S0021-9673(01)87784-0
. [all data]