1-Butanol, 3-methyl-, carbonate (2:1)
- Formula: C11H22O3
- Molecular weight: 202.2906
- IUPAC Standard InChIKey: DWWPOAYNAWHBKI-UHFFFAOYSA-N
- CAS Registry Number: 2050-95-5
- Chemical structure:
View 3d structure (requires JavaScript / HTML 5) - Other names: Di-iso-amyl carbonate; diisopentyl carbonate

Phase change data

Data compiled by: Thermodynamics Research Center, NIST Boulder Laboratories, Chris Muzny director
Quantity | Value | Units | Method | Reference | Comment |
---|---|---|---|---|---|
Tboil | 505.35 | K | N/A | Lecat, 1943 | Uncertainty assigned by TRC = 0.4 K |

References

Lecat, 1943
Lecat, M.,
Azeotropes of Ethyl Urethane and other Azeotropes,
C. R. Hebd. Seances Acad. Sci., 1943, 217, 273. [all data]