1-Pentanamine, N-pentyl-
- Formula: C10H23N
- Molecular weight: 157.2963
- IUPAC Standard InChIKey: JACMPVXHEARCBO-UHFFFAOYSA-N
- CAS Registry Number: 2050-92-2
- Chemical structure:
View 3d structure (requires JavaScript / HTML 5) - Other names: Dipentylamine; Di-n-amylamine; Di-n-pentylamine; Diamylamine; Pentylamine, pentyl-; UN 2841

Phase change data

Data compiled as indicated in comments:
BS - Robert L. Brown and Stephen E. Stein
TRC - Thermodynamics Research Center, NIST Boulder Laboratories, Chris Muzny director
AC - William E. Acree, Jr., James S. Chickos
Quantity | Value | Units | Method | Reference | Comment |
---|---|---|---|---|---|
Tboil | 475.7 | K | N/A | Weast and Grasselli, 1989 | BS |
Tboil | 476.15 | K | N/A | Borrows, Hargreaves, et al., 1947 | Uncertainty assigned by TRC = 2. K; TRC |
Tboil | 478.15 | K | N/A | Winans and Adkins, 1933 | Uncertainty assigned by TRC = 6. K; TRC |
Tboil | 475.65 | K | N/A | Winans and Adkins, 1932 | Uncertainty assigned by TRC = 3. K; TRC |
Tboil | 477.15 | K | N/A | Winans and Adkins, 1932 | Uncertainty assigned by TRC = 0.003 K; TRC |
Reduced pressure boiling point
Tboil (K) | Pressure (atm) | Reference | Comment |
---|---|---|---|
365.2 | 0.018 | Weast and Grasselli, 1989 | BS |
Enthalpy of vaporization
ΔvapH (kcal/mol) | Temperature (K) | Method | Reference | Comment |
---|---|---|---|---|
12.2 | 394. | A | Stephenson and Malanowski, 1987 | Based on data from 379. to 527. K.; AC |

References

Weast and Grasselli, 1989
CRC Handbook of Data on Organic Compounds, 2nd Editon, Weast,R.C and Grasselli, J.G., ed(s)., CRC Press, Inc., Boca Raton, FL, 1989, 1. [all data]
Borrows, Hargreaves, et al., 1947
Borrows, E.T.; Hargreaves, B.M.C.; Page, J.E.; Resuggan, J.C.L.; Robinson, F.A.,
Preparation and Properties of Some Long Chain Aliphatic Amines,
J. Chem. Soc., 1947, 1947, 197. [all data]
Winans and Adkins, 1933
Winans; Adkins,
J. Am. Chem. Soc., 1933, 55, 2051. [all data]
Winans and Adkins, 1932
Winans, C.F.; Adkins, H.,
The Alkylation of Amines as Catalyzed by Nickel,
J. Am. Chem. Soc., 1932, 54, 306. [all data]
Stephenson and Malanowski, 1987
Stephenson, Richard M.; Malanowski, Stanislaw,
Handbook of the Thermodynamics of Organic Compounds, 1987, https://doi.org/10.1007/978-94-009-3173-2
. [all data]