Ethanedioic acid, dibutyl ester
- Formula: C10H18O4
- Molecular weight: 202.2475
- IUPAC Standard InChIKey: JKRZOJADNVOXPM-UHFFFAOYSA-N
- CAS Registry Number: 2050-60-4
- Chemical structure:
View 3d structure (requires JavaScript / HTML 5) - Other names: Oxalic acid, dibutyl ester; Di-n-butyl oxalate; Dibutyl oxalate; Oxalic acid di-n-butyl ester; Butyl ethanedioate; Butyl oxalate; Dibutyl ester of oxalic acid

Phase change data

Data compiled as indicated in comments:
BS - Robert L. Brown and Stephen E. Stein
TRC - Thermodynamics Research Center, NIST Boulder Laboratories, Chris Muzny director
Quantity | Value | Units | Method | Reference | Comment |
---|---|---|---|---|---|
Tboil | 512.7 | K | N/A | Aldrich Chemical Company Inc., 1990 | BS |
Tboil | 518.7 | K | N/A | Timmermans, 1927 | Uncertainty assigned by TRC = 0.5 K; source of data not clear; TRC |

References

Aldrich Chemical Company Inc., 1990
Aldrich Chemical Company Inc.,
Catalog Handbook of Fine Chemicals, Aldrich Chemical Company, Inc., Milwaukee WI, 1990, 1. [all data]
Timmermans, 1927
Timmermans, J.,
The Melting Point of Organic Substances,
Bull. Soc. Chim. Belg., 1927, 36, 502. [all data]