4-Bromophenyl ether
- Formula: C12H8Br2O
- Molecular weight: 327.999
- IUPAC Standard InChIKey: YAWIAFUBXXPJMQ-UHFFFAOYSA-N
- CAS Registry Number: 2050-47-7
- Chemical structure:
View 3d structure (requires JavaScript / HTML 5) - Other names: di(4-Bromophenyl)ether; 4,4'-Dibromodiphenyl ether; Bis(p-bromophenyl)ether; Bis-(4-bromophenyl) ether; Benzene, 1,1'-oxybis[4-bromo-; p,p'-Dibromodiphenyl ether; Bis(bromophenyl) ether; Ether, bis(p-bromophenyl); Ether, bis(4-bromophenyl); USAF DO-61; Diphenyl ether, 4,4'-dibromo; NSC 1787; NSC 9487; 4,4'-BDE

Phase change data

Data compiled as indicated in comments:
BS - Robert L. Brown and Stephen E. Stein
TRC - Thermodynamics Research Center, NIST Boulder Laboratories, Chris Muzny director
AC - William E. Acree, Jr., James S. Chickos
Quantity | Value | Units | Method | Reference | Comment |
---|---|---|---|---|---|
Tboil | 612.2 | K | N/A | Weast and Grasselli, 1989 | BS |
Quantity | Value | Units | Method | Reference | Comment |
Tfus | 327.15 | K | N/A | Beringer, Brierley, et al., 1953 | Uncertainty assigned by TRC = 1.5 K; TRC |
Tfus | 327.15 | K | N/A | Beringer, Brierley, et al., 1953 | Uncertainty assigned by TRC = 1.5 K; TRC |
Enthalpy of vaporization
ΔvapH (kJ/mol) | Temperature (K) | Method | Reference | Comment |
---|---|---|---|---|
78.0 | 418. | GC | Wong, Lei, et al., 2001 | Based on data from 363. to 473. K.; AC |

Normal alkane RI, non-polar column, temperature ramp

Column type | Active phase | I | Reference | Comment |
---|---|---|---|---|
Capillary | Ultra-1 | 1936. | Okumura, 1991 | 25. m/0.32 mm/0.25 μm, He, 3. K/min; Tstart: 80. C; Tend: 260. C |

References

Weast and Grasselli, 1989
CRC Handbook of Data on Organic Compounds, 2nd Editon, Weast,R.C and Grasselli, J.G., ed(s)., CRC Press, Inc., Boca Raton, FL, 1989, 1. [all data]
Beringer, Brierley, et al., 1953
Beringer, F.M.; Brierley, A.; Drexler, M.; Gindler, E.M.; Lumpkin, C.C.,
Diaryliodonium Salts II. The Phenylation of Organic and Inorganic Bases,
J. Am. Chem. Soc., 1953, 75, 2708. [all data]
Wong, Lei, et al., 2001
Wong, Alexander; Lei, Ying Duan; Alaee, Mehran; Wania, Frank,
Vapor Pressures of the Polybrominated Diphenyl Ethers,
J. Chem. Eng. Data, 2001, 46, 2, 239-242, https://doi.org/10.1021/je0002181
. [all data]
Okumura, 1991
Okumura, T.,
retention indices of environmental chemicals on methyl silicone capillary column,
Journal of Environmental Chemistry (Japan), 1991, 1, 2, 333-358, https://doi.org/10.5985/jec.1.333
. [all data]