Pentanoic acid, 3-methylbutyl ester

Phase change data

Data compiled by: Thermodynamics Research Center, NIST Boulder Laboratories, Chris Muzny director

Quantity Value Units Method Reference Comment
Tboil466.KN/ARajyam and Murty, 1974Uncertainty assigned by TRC = 4. K

In addition to the Thermodynamics Research Center (TRC) data available from this site, much more physical and chemical property data is available from the following TRC products:

Kovats' RI, non-polar column, isothermal

View large format table.

Column type Active phase Temperature (C) I Reference Comment
PackedSE-30150.1132.Ashes and Haken, 1974Celaton (62-72 mesh); Column length: 3.7 m
PackedSE-30150.1134.Germaine and Haken, 1969Celite 560; Column length: 3.7 m

Kovats' RI, non-polar column, custom temperature program

View large format table.

Column type Active phase I Reference Comment
CapillarySE-301132.Chretien and Dubois, 1978Program: not specified

Van Den Dool and Kratz RI, non-polar column, temperature ramp

View large format table.

Column type Active phase I Reference Comment
CapillaryRSL-2001108.Ngassoum, Ousmaila, et al., 200430. m/0.32 mm/0.25 μm, H2, 40. C @ 5. min, 6. K/min, 280. C @ 5. min
CapillaryDB-51106.Nogueira, Bittrich, et al., 200130. m/0.25 mm/0.25 μm, H2, 3. K/min; Tstart: 60. C; Tend: 240. C
CapillaryCP Sil 5 CB1090.Pino, Marbot, et al., 200150. m/0.32 mm/0.4 μm, He, 60. C @ 10. min, 3. K/min, 280. C @ 60. min
CapillaryCP Sil 5 CB1104.Montanarella, Bos, et al., 1986N2, 4. K/min; Column length: 25. m; Column diameter: 0.22 mm; Tstart: 70. C; Tend: 295. C

Normal alkane RI, non-polar column, temperature ramp

View large format table.

Column type Active phase I Reference Comment
CapillaryDB-51152.Fan and Qian, 200630. m/0.32 mm/0.25 μm, He, 40. C @ 2. min, 4. K/min, 250. C @ 15. min
CapillaryDB-51152.Fan and Qian, 200630. m/0.32 mm/1. μm, He, 40. C @ 2. min, 4. K/min, 250. C @ 15. min
CapillarySE-521104.Ozcan, Chalchat, et al., 2006Helium, 3. K/min; Column length: 50. m; Column diameter: 0.25 mm; Tstart: 50. C; Tend: 240. C
CapillaryOV-1011138.Camciuc, Bessière, et al., 199850. m/0.22 mm/1. μm, He, 100. C @ 1. min, 1. K/min; Tend: 220. C
CapillaryDB-11134.Shiota, 199330. m/0.25 mm/0.25 μm, He, 50. C @ 5. min, 3. K/min; Tend: 240. C
CapillaryDB-11134.Shiota, 199330. m/0.25 mm/0.25 μm, He, 50. C @ 5. min, 3. K/min; Tend: 240. C
CapillaryDB-11133.Shiota, 199330. m/0.25 mm/0.25 μm, He, 50. C @ 3. min, 5. K/min; Tend: 240. C
CapillaryDB-11134.Shiota, 199330. m/0.25 mm/0.25 μm, He, 50. C @ 3. min, 5. K/min; Tend: 240. C

Normal alkane RI, non-polar column, custom temperature program

View large format table.

Column type Active phase I Reference Comment
CapillaryHP-51105.Zhao, Li, et al., 200830. m/0.25 mm/0.25 μm; Program: 40 0C (2 min) 5 0C/min -> 80 0C 7 oC/min -> 160 0C 9 0C/min -> 200 0C 20 0C/min -> 280 0C (10 min)
CapillaryHP-51134.Zhao, Li, et al., 200830. m/0.25 mm/0.25 μm; Program: not specified
CapillarySE-301132.Liu, Liang, et al., 2007Program: not specified
CapillarySE-301138.Vinogradov, 2004Program: not specified

Normal alkane RI, polar column, temperature ramp

View large format table.

Column type Active phase I Reference Comment
CapillaryDB-Wax1346.Fan and Qian, 200630. m/0.25 mm/0.25 μm, He, 40. C @ 2. min, 4. K/min, 230. C @ 15. min

Normal alkane RI, polar column, custom temperature program

View large format table.

Column type Active phase I Reference Comment
CapillaryCarbowax 20M1354.Vinogradov, 2004Program: not specified

References

Rajyam and Murty, 1974
Rajyam, B.; Murty, C.R.K., Study of Dielectric Relaxation & Measurement of Dipole Moments of Esters Part IV. Amyl Esters, Indian J. Pure Appl. Phys., 1974, 12, 697-700. [all data]

Ashes and Haken, 1974
Ashes, J.R.; Haken, J.K., Gas chromatography of homologous esters. VI. Structure-retention increments of aliphatic esters, J. Chromatogr., 1974, 101, 1, 103-123, https://doi.org/10.1016/S0021-9673(01)94737-5 . [all data]

Germaine and Haken, 1969
Germaine, R.W.; Haken, J.K., Gas chromatography of homologous esters. Part 1. Simple aliphatic esters, J. Chromatogr., 1969, 43, 33-42, https://doi.org/10.1016/S0021-9673(00)99162-3 . [all data]

Chretien and Dubois, 1978
Chretien, J.R.; Dubois, J-E., Topological Analysis: A Technique for the Physico-Chemical Exploitation of Retention Data in Gas-Liquid Chromatography, J. Chromatogr., 1978, 158, 43-56, https://doi.org/10.1016/S0021-9673(00)89954-9 . [all data]

Ngassoum, Ousmaila, et al., 2004
Ngassoum, M.B.; Ousmaila, H.; Ngamo, L.T.; Maponmetsem, P.M.; Jirovetz, L.; Buchbauer, G., Aroma compounds of essential oils of two varieties of the spice plant Ocimum canum Sims from northern Cameroon, J. Food Comp. Anal., 2004, 17, 2, 197-204, https://doi.org/10.1016/j.jfca.2003.08.002 . [all data]

Nogueira, Bittrich, et al., 2001
Nogueira, P.C.L.; Bittrich, V.; Shepherd, G.J.; Lopes, A.V.; Marsaioli, A.J., The ecological and taxonomic importance of flower volatiles of Clusia species (Guttiferae), Phytochemistry, 2001, 56, 5, 443-452, https://doi.org/10.1016/S0031-9422(00)00213-2 . [all data]

Pino, Marbot, et al., 2001
Pino, J.A.; Marbot, R.; Vázquez, C., Characterization of volatiles in strawberry guava (Psidium cattleianum Sabine) fruit, J. Agric. Food Chem., 2001, 49, 12, 5883-5887, https://doi.org/10.1021/jf010414r . [all data]

Montanarella, Bos, et al., 1986
Montanarella, L.; Bos, R.; Fischer, F.C., The Essential Oil in Lamina and Petiole of Heracleum dissectum Leaves, Planta Medica, 1986, 52, 04, 332-334, https://doi.org/10.1055/s-2007-969171 . [all data]

Fan and Qian, 2006
Fan, W.; Qian, M.C., Characterization of Aroma Compounds of Chinese Wuliangye and Jiannanchun Liquors by Aroma Extract Dilution Analysis, J. Agric. Food Chem., 2006, 54, 7, 2695-2704, https://doi.org/10.1021/jf052635t . [all data]

Ozcan, Chalchat, et al., 2006
Ozcan, M.M.; Chalchat, J.-C.; Arslan, D.; Ates, A.; Unver, A., Comparative Essential Oil Composition and Antifungal Effect of Bitter Fennel (Foeniculum vulgare ssp. piperitum) Fruit Oils Obtained During Different Vegetation, J. Medicinal Food, 2006, 9, 4, 552-561, https://doi.org/10.1089/jmf.2006.9.552 . [all data]

Camciuc, Bessière, et al., 1998
Camciuc, M.; Bessière, J.M.; Vilarem, G.; Gaset, A., Volatile components in okra seed coat, Phytochemistry, 1998, 48, 2, 311-315, https://doi.org/10.1016/S0031-9422(97)01127-8 . [all data]

Shiota, 1993
Shiota, H., New esteric components in the volatiles of banana fruit (Musa sapientum L.), J. Agric. Food Chem., 1993, 41, 11, 2056-2062, https://doi.org/10.1021/jf00035a046 . [all data]

Zhao, Li, et al., 2008
Zhao, Y.; Li, J.; Xu, Y.; Duan, H.; Fan, W.; Zhao, G., EXtraction, preparation and identification of volatile compounds in Changyu XO brandy, Chinese J. Chromatogr., 2008, 26, 2, 212-222, https://doi.org/10.1016/S1872-2059(08)60014-0 . [all data]

Liu, Liang, et al., 2007
Liu, F.; Liang, Y.; Cao, C.; Zhou, N., QSPR study of GC retention indices for saturated esters on seven stationary phases based on novel topological indices, Talanta, 2007, 72, 4, 1307-1315, https://doi.org/10.1016/j.talanta.2007.01.038 . [all data]

Vinogradov, 2004
Vinogradov, B.A., Production, composition, properties and application of essential oils, 2004, retrieved from http://viness.narod.ru. [all data]