Propanoic acid, 2-methyl-, 3-methylbutyl ester
- Formula: C9H18O2
- Molecular weight: 158.2380
- IUPAC Standard InChIKey: VFTGLSWXJMRZNB-UHFFFAOYSA-N
- CAS Registry Number: 2050-01-3
- Chemical structure:
View 3d structure (requires JavaScript / HTML 5) - Other names: Isobutyric acid, isopentyl ester; iso-Amyl iso-butyrate; 3-Methylbutyl 2-methylpropanoate; 3-Methylbutyl isobutyrate; Isoamyl isobutanoate; Isopentyl isobutanoate; Isoamyl 2-methylpropanoate; Isopentyl alcohol, isobutyrate; 3-Methyl-1-butyl isobutyrate; Isopentyl isobutyrate; Isopentyl 2-methylpropanoate

Phase change data

Data compiled as indicated in comments:
TRC - Thermodynamics Research Center, NIST Boulder Laboratories, Chris Muzny director
AC - William E. Acree, Jr., James S. Chickos
Quantity | Value | Units | Method | Reference | Comment |
---|---|---|---|---|---|
Tboil | 442.95 | K | N/A | Lecat, 1943 | Uncertainty assigned by TRC = 0.3 K; TRC |
Tboil | 442.1 | K | N/A | Lecat, 1927 | Uncertainty assigned by TRC = 0.5 K; TRC |
Enthalpy of vaporization
ΔvapH (kJ/mol) | Temperature (K) | Method | Reference | Comment |
---|---|---|---|---|
47.4 | 302. | A | Stephenson and Malanowski, 1987 | Based on data from 287. to 442. K. See also Stull, 1947.; AC |
Antoine Equation Parameters
log10(P) = A − (B / (T + C))
P = vapor pressure (bar)
T = temperature (K)
View plot Requires a JavaScript / HTML 5 canvas capable browser.
Temperature (K) | A | B | C | Reference | Comment |
---|---|---|---|---|---|
287.9 to 442.0 | 4.6188 | 1848.636 | -41.246 | Stull, 1947 | Coefficents calculated by NIST from author's data. |

Normal alkane RI, polar column, temperature ramp

Data compiled by: NIST Mass Spectrometry Data Center, William E. Wallace, director

Column type CapillaryCapillaryCapillaryCapillaryCapillary
Active phase CP-Wax CBCP-Wax 52CBDB-WaxDB-WaxCarbowax 20M
Column length (m) 30.30.30.60.80.
Carrier gas HeliumHeH2He
Substrate
Column diameter (mm) 0.25 0.250.250.2
Phase thickness (μm) 0.250.320.50.25
Tstart (C) 50.50.50.40.70.
Tend (C) 150.220.200.200.170.
Heat rate (K/min) 2.6.3.2.2.
Initial hold (min)  2.10.
Final hold (min) 5.20.10.
I 1194.1183.1234.1183.1187.
ReferenceAlves, da Penha, et al., 2012Audino, Alzogaray, et al., 2007Alves and Franco, 2003Wei, Mura, et al., 2001Anker, Jurs, et al., 1990
Comment MSDC-RI MSDC-RI MSDC-RI MSDC-RI MSDC-RI

Van Den Dool and Kratz RI, non-polar column, custom temperature program

Data compiled by: NIST Mass Spectrometry Data Center, William E. Wallace, director

Column type CapillaryCapillary
Active phase HP-5MSDB-1
Column length (m) 30.60.
Carrier gas HeHe
Substrate
Column diameter (mm) 0.250.25
Phase thickness (μm) 0.250.25
Program 60C (1 min) => 5 C/min => 210C => 10 C/min => 280C (15 min)-20C (5min) => 10C/min => 100C => 4C/min => 200C => 10C/min => 280C
I 1013.4996.
ReferenceAndriamaharavo, 2014Eri, Khoo, et al., 2000
Comment MSDC-RI MSDC-RI

Van Den Dool and Kratz RI, non-polar column, temperature ramp

Data compiled by: NIST Mass Spectrometry Data Center, William E. Wallace, director

Column type CapillaryCapillaryCapillary
Active phase DB-1DB-5DB-5
Column length (m) 60.30.30.
Carrier gas HeH2H2
Substrate
Column diameter (mm) 0.250.320.32
Phase thickness (μm) 0.251.1.
Tstart (C) 40.40.40.
Tend (C) 280.210.210.
Heat rate (K/min) 4.3.3.
Initial hold (min) 5.
Final hold (min)
I 996.1020.1021.
ReferenceOmidbaigi, Sefidkon, et al., 2004Moio and Addeo, 1998Moio and Addeo, 1998
Comment MSDC-RI MSDC-RI MSDC-RI

Normal alkane RI, non-polar column, temperature ramp

Data compiled by: NIST Mass Spectrometry Data Center, William E. Wallace, director

Column type CapillaryCapillaryCapillaryCapillaryCapillary
Active phase VF-5 MSVF-5 MSHP-5 MSZB-1DB-1
Column length (m) 60.60.30.30.30.
Carrier gas HeliumHeliumHeliumNitrogenHe
Substrate
Column diameter (mm) 0.320.320.250.25
Phase thickness (μm) 0.250.250.250.250.25
Tstart (C) 30.30.50.45.50.
Tend (C) 260.260.230.230.220.
Heat rate (K/min) 2.2.4.3.6.
Initial hold (min)   4. 2.
Final hold (min) 28.28.10. 20.
I 1014.1015.1018.995.998.
ReferenceLeffingwell and Alford, 2011Leffingwell and Alford, 2011Forero, Quijano, et al., 2008Mierendorff, Stahl-Biskup, et al., 2008Audino, Alzogaray, et al., 2007
Comment MSDC-RI MSDC-RI MSDC-RI MSDC-RI MSDC-RI
Column type CapillaryCapillaryCapillaryCapillaryCapillary
Active phase HP-5HP-5ZB-1DB-5HP-5
Column length (m) 30.60.30.30.30.
Carrier gas H2HeN2HeN2
Substrate
Column diameter (mm) 0.250.320.250.250.25
Phase thickness (μm) 0.250.250.250.250.25
Tstart (C) 50.30.45.60.60.
Tend (C) 280.260.230.240.220.
Heat rate (K/min) 4.2.3.3.5.
Initial hold (min) 2.2.  10.
Final hold (min) 10.28.
I 1021.1018.3995.1013.1017.
ReferencePino, Sauri-Duch, et al., 2006Leffingwell and Alford, 2005Mierendorff, Stahl-Biskup, et al., 2003Zoghbi, Andrade, et al., 2002Gallori, Flamini, et al., 2001
Comment MSDC-RI MSDC-RI MSDC-RI MSDC-RI MSDC-RI
Column type CapillaryCapillaryCapillary
Active phase DB-1DB-1OV-101
Column length (m) 30.30.50.
Carrier gas HeHe
Substrate
Column diameter (mm) 0.250.250.28
Phase thickness (μm) 0.250.25
Tstart (C) 50.50.80.
Tend (C) 240.240.200.
Heat rate (K/min) 5.5.2.
Initial hold (min) 3.3.
Final hold (min)
I 994.998.997.
ReferenceShiota, 1993Shiota, 1993Anker, Jurs, et al., 1990
Comment MSDC-RI MSDC-RI MSDC-RI

Kovats' RI, non-polar column, temperature ramp

Data compiled by: NIST Mass Spectrometry Data Center, William E. Wallace, director

Column type Capillary
Active phase BP-1
Column length (m) 25.
Carrier gas N2
Substrate
Column diameter (mm) 0.55
Phase thickness (μm) 0.25
Tstart (C) 60.
Tend (C) 220.
Heat rate (K/min) 5.
Initial hold (min)
Final hold (min) 15.
I 1000.
ReferenceSrivastava, Ahmad, et al., 2003
Comment MSDC-RI

References

Lecat, 1943
Lecat, M.,
Azeotropes of Ethyl Urethane and other Azeotropes,
C. R. Hebd. Seances Acad. Sci., 1943, 217, 273. [all data]
Lecat, 1927
Lecat, M.,
New binary azeotropes: 6th list,
Ann. Soc. Sci. Bruxelles, Ser. B, 1927, 47, 63-71. [all data]
Stephenson and Malanowski, 1987
Stephenson, Richard M.; Malanowski, Stanislaw,
Handbook of the Thermodynamics of Organic Compounds, 1987, https://doi.org/10.1007/978-94-009-3173-2
. [all data]
Stull, 1947
Stull, Daniel R.,
Vapor Pressure of Pure Substances. Organic and Inorganic Compounds,
Ind. Eng. Chem., 1947, 39, 4, 517-540, https://doi.org/10.1021/ie50448a022
. [all data]