5-tert-Butylpyrogallol

Normal alkane RI, non-polar column, temperature ramp

Data compiled by: NIST Mass Spectrometry Data Center, William E. Wallace, director

Column type Capillary
Active phase VF-5 MS
Column length (m) 30.
Carrier gas Helium
Substrate
Column diameter (mm) 0.25
Phase thickness (μm) 0.25
Tstart (C) 60.
Tend (C) 280.
Heat rate (K/min) 6.
Initial hold (min) 1.
Final hold (min) 3.
I 1526.
ReferenceSouza, Re-Poppi, et al., 2012
Comment MSDC-RI

References

Souza, Re-Poppi, et al., 2012
Souza, J.B.G.; Re-Poppi, N.; Raposo, J.L.(Jr)., Characterization of pyroligneous acid used in agriculture by gas chromatography - mass spectrometry (in press), J. Braz. Chem. Soc., 2012, 00, 00, 1-8. [all data]