1,2,3,4,4a,9,10,10a-Octahydrophenanthrene (trans)
- Formula: C14H18
- Molecular weight: 186.2927
- IUPAC Standard InChIKey: KFGROPZLGDSAPK-OCCSQVGLSA-N
- CAS Registry Number: 20480-67-5
- Chemical structure:
View 3d structure (requires JavaScript / HTML 5) - Stereoisomers:
- Other names: 1,2,3,4,4a,9,10,10a-Octahydrophenanthrene, (E)-; trans-1,2,3,4,4a,9,10,10a-Octahydrophenanthrene

Gas phase thermochemistry data

Data compiled by: Glushko Thermocenter, Russian Academy of Sciences, Moscow
Constant pressure heat capacity of gas
Cp,gas (J/mol*K) | Temperature (K) | Reference | Comment |
---|---|---|---|
48.28 | 50. | Dorofeeva O.V., 1988 | Recommended values were calculated statistically mechanically using force field approximation for polycyclic aromatic hydrocarbons to estimate the needed vibrational frequencies (see also [ Dorofeeva O.V., 1986]). These functions are reproduced in the reference book [ Frenkel M., 1994]. |
76.90 | 100. | ||
109.10 | 150. | ||
144.00 | 200. | ||
200.82 | 273.15 | ||
221.2 ± 3.0 | 298.15 | ||
222.69 | 300. | ||
302.30 | 400. | ||
371.88 | 500. | ||
429.47 | 600. | ||
476.88 | 700. | ||
516.29 | 800. | ||
549.36 | 900. | ||
577.31 | 1000. | ||
601.06 | 1100. | ||
621.33 | 1200. | ||
638.69 | 1300. | ||
653.62 | 1400. | ||
666.51 | 1500. |

References

Dorofeeva O.V., 1988
Dorofeeva O.V.,
Thermodynamic Properties of Polycyclic Aromatic Hydrocarbons in the Gaseous Phase. Institute for High Temperatures, USSR Academy of Sciences, Preprint No.1-238 (in Russian), Moscow, 1988. [all data]
Dorofeeva O.V., 1986
Dorofeeva O.V.,
On calculation of thermodynamic properties of polycyclic aromatic hydrocarbons,
Thermochim. Acta, 1986, 102, 59-66. [all data]
Frenkel M., 1994
Frenkel M.,
Thermodynamics of Organic Compounds in the Gas State, Vol. I, II, Thermodynamics Research Center, College Station, Texas, 1994, 1994. [all data]