1,1,1-Trimethyldigermane

Phase change data

Data compiled by: William E. Acree, Jr., James S. Chickos

Enthalpy of vaporization

ΔvapH (kJ/mol) Temperature (K) Reference Comment
36.1300.Dutton and Onyszchuk, 1968Based on data from 273. - 327. K.

References

Dutton and Onyszchuk, 1968
Dutton, Walter A.; Onyszchuk, Mario, Preparation and properties of methyl(germyl) silanes and some related compounds, Inorg. Chem., 1968, 7, 9, 1735-1739, https://doi.org/10.1021/ic50067a008 . [all data]