1,4-Dimethyl-bicyclo[2.2.1]heptane
- Formula: C9H16
- Molecular weight: 124.2233
- IUPAC Standard InChIKey: VOVKYFRBXIHZAA-UHFFFAOYSA-N
- CAS Registry Number: 20454-81-3
- Chemical structure:
View 3d structure (requires JavaScript / HTML 5) - Permanent link for this species. Use this link for bookmarking this species for future reference.

Gas phase thermochemistry data

Data compiled by: Hussein Y. Afeefy, Joel F. Liebman, and Stephen E. Stein
Quantity | Value | Units | Method | Reference | Comment |
---|---|---|---|---|---|
ΔfH°gas | -128.2 ± 1.6 | kJ/mol | Ccb | Kozina, Timofeeva, et al., 1971 |

Condensed phase thermochemistry data

Data compiled by: Hussein Y. Afeefy, Joel F. Liebman, and Stephen E. Stein
Quantity | Value | Units | Method | Reference | Comment |
---|---|---|---|---|---|
ΔfH°liquid | -167.5 ± 1.3 | kJ/mol | Ccb | Kozina, Timofeeva, et al., 1971 | |
Quantity | Value | Units | Method | Reference | Comment |
ΔcH°liquid | -5660.8 ± 1.3 | kJ/mol | Ccb | Kozina, Timofeeva, et al., 1971 | Corresponding ΔfHºliquid = -167.4 kJ/mol (simple calculation by NIST; no Washburn corrections) |

Phase change data

Data compiled as indicated in comments:
DRB - Donald R. Burgess, Jr.
ALS - Hussein Y. Afeefy, Joel F. Liebman, and Stephen E. Stein
AC - William E. Acree, Jr., James S. Chickos
Quantity | Value | Units | Method | Reference | Comment |
---|---|---|---|---|---|
ΔvapH° | 39.3 | kJ/mol | N/A | Kozina, Timofeeva, et al., 1971 | DRB |
ΔvapH° | 39. ± 0.8 | kJ/mol | V | Varushchenko, Balikova, et al., 1970 | ALS |
Enthalpy of vaporization
ΔvapH (kJ/mol) | Temperature (K) | Method | Reference | Comment |
---|---|---|---|---|
36.8 | 343. | A | Stephenson and Malanowski, 1987 | Based on data from 328. to 393. K. See also Varushchenko, Belikova, et al., 1970 and Boublik, Fried, et al., 1984.; AC |

References

Kozina, Timofeeva, et al., 1971
Kozina, M.P.; Timofeeva, L.P.; Skuratov, S.M.; Belikova, N.A.; Milvitskaya, E.M.; Plate, A.F.,
The enthalpies of combustion of some bicyclic compounds,
J. Chem. Thermodyn., 1971, 3, 563-570. [all data]
Varushchenko, Balikova, et al., 1970
Varushchenko, R.M.; Balikova, N.A.; Skuratov, S.M.; Plate, A.F.,
Vapour pressures and boiling points of hydrocarbons. I. 1,4-and trans-2,3-dimethylbicyclo[2,2,1]-heptanes,
Russ. J. Phys. Chem. (Engl. Transl.), 1970, 44, 1722-1724. [all data]
Stephenson and Malanowski, 1987
Stephenson, Richard M.; Malanowski, Stanislaw,
Handbook of the Thermodynamics of Organic Compounds, 1987, https://doi.org/10.1007/978-94-009-3173-2
. [all data]
Varushchenko, Belikova, et al., 1970
Varushchenko, R.M.; Belikova, N.A.; Skuratov, S.M.; Plate, A.F.,
Zh. Fiz. Khim., 1970, 44, 12, 3022. [all data]
Boublik, Fried, et al., 1984
Boublik, T.; Fried, V.; Hala, E.,
The Vapour Pressures of Pure Substances: Selected Values of the Temperature Dependence of the Vapour Pressures of Some Pure Substances in the Normal and Low Pressure Region, 2nd ed., Elsevier, New York, 1984, 972. [all data]