Benzenamine, N-methyl-2,4-dinitro-

Condensed phase thermochemistry data

Data compiled by: Hussein Y. Afeefy, Joel F. Liebman, and Stephen E. Stein

Quantity Value Units Method Reference Comment
Δfsolid-67.4 ± 3.7kJ/molCcbMedard and Thomas, 1954Heat of combustion corrected for pressure
Quantity Value Units Method Reference Comment
Δcsolid-3688. ± 3.7kJ/molCcbMedard and Thomas, 1954Heat of combustion corrected for pressure
Δcsolid-3705.kJ/molCcbGarner and Abernethy, 1921

References

Medard and Thomas, 1954
Medard, L.; Thomas, M., Chaleurs de combustion de vingt-quatre substances explosives ou apparentees a des explosifs, Mem. Poudres, 1954, 36, 97-127. [all data]

Garner and Abernethy, 1921
Garner, W.E.; Abernethy, C.L., Heats of combustion and formation of nitro-compounds. Part I. - Benzene, toluene, phenol and methylaniline series, Proc. Roy. Soc. London A, 1921, 213-235. [all data]