2(1H)-Pyridinethione, 1-methyl-
- Formula: C6H7NS
- Molecular weight: 125.191
- IUPAC Standard InChIKey: UHOAUPKGWPQNDM-UHFFFAOYSA-N
- CAS Registry Number: 2044-27-1
- Chemical structure:
View 3d structure (requires JavaScript / HTML 5) - Other names: N-Methyl-2-pyridinethione; 1-Methyl-2-pyridinethione; 1-Methyl-2-thiopyridone; 1-Methyl-2(1H)-pyridinethione; N-Methylthiopyridone-2

Reaction thermochemistry data

Data compiled by: Hussein Y. Afeefy, Joel F. Liebman, and Stephen E. Stein
Individual Reactions
By formula: C6H7NS = C6H7NS
Quantity | Value | Units | Method | Reference | Comment |
---|---|---|---|---|---|
ΔrH° | -11. ± 5.4 | kJ/mol | Eqk | Beak and Lee, 1969 | liquid phase; solvent: CDCl3; NMR |

Gas phase ion energetics data

Data compiled by: Sharon G. Lias, Rhoda D. Levin, and Sherif A. Kafafi
Ionization energy determinations
IE (eV) | Method | Reference | Comment |
---|---|---|---|
7.84 ± 0.02 | EI | Gronneberg and Undheim, 1972 | |
7.69 ± 0.03 | PE | Cook, El-Abbady, et al., 1977 | Vertical value |

References

Beak and Lee, 1969
Beak, P.; Lee, J.T., Jr.,
Equilibration studies. 2-Methylthiopyridine-N-methyl-2-thiopyridone,
J. Org. Chem., 1969, 34, 2125-2128. [all data]