2,3,3,4-tetramethyl-1-pentene
- Formula: C9H18
- Molecular weight: 126.2392
- IUPAC Standard InChIKey: PFOPJQGUEOQOBF-UHFFFAOYSA-N
- CAS Registry Number: 20442-63-1
- Chemical structure:
View 3d structure (requires JavaScript / HTML 5) - Permanent link for this species. Use this link for bookmarking this species for future reference.

Phase change data

Data compiled by: Thermodynamics Research Center, NIST Boulder Laboratories, Chris Muzny director
Quantity | Value | Units | Method | Reference | Comment |
---|---|---|---|---|---|
Tboil | 407.7 | K | N/A | Fenske, Braun, et al., 1947 | Uncertainty assigned by TRC = 0.15 K |
Tboil | 406.35 | K | N/A | Howard, Mears, et al., 1947 | Uncertainty assigned by TRC = 0.2 K |
Tboil | 408.6 | K | N/A | Cline, 1940 | Uncertainty assigned by TRC = 1. K |
Tboil | 408.6 | K | N/A | Cline, 1939 | Uncertainty assigned by TRC = 1. K |

References

Fenske, Braun, et al., 1947
Fenske, M.R.; Braun, W.G.; Wiegand, R.V.; Quiggle, D.; McCormick, R.H.; Rank, D.H.,
Raman Spectra of Hydrocarbons,
Anal. Chem., 1947, 19, 700. [all data]
Howard, Mears, et al., 1947
Howard, F.L.; Mears, T.W.; Fookson, A.; Pomerantz, P.; Brooks, D.B.,
Preparation and physical properties of several aliphatic hydrocarbons and intermediates,
J. Res. Natl. Bur. Stand. (U. S.), 1947, 38, 365. [all data]
Cline, 1940
Cline, E.T.,
, PhD Thesis, 1940. [all data]
Cline, 1939
Cline, E.T.,
The Synthesis of Type III and Type V Olefins from Dimethylbutadien- monohydrobromide, Ph.D. Dissertation, Ohio State Univ., Columbus, OH, 1939. [all data]