Benzonitrile, 2-bromo-
- Formula: C7H4BrN
- Molecular weight: 182.017
- IUPAC Standard InChIKey: AFMPMSCZPVNPEM-UHFFFAOYSA-N
- CAS Registry Number: 2042-37-7
- Chemical structure:
View 3d structure (requires JavaScript / HTML 5) - Other names: Benzonitrile, o-bromo-; o-Bromobenzonitrile; 1-Bromo-2-cyanobenzene; 2-Bromobenzonitrile

Phase change data

Data compiled by: Robert L. Brown and Stephen E. Stein
Quantity | Value | Units | Method | Reference | Comment |
---|---|---|---|---|---|
Tboil | 525.2 | K | N/A | Aldrich Chemical Company Inc., 1990 | |
Quantity | Value | Units | Method | Reference | Comment |
Tfus | 329. | K | N/A | Buckingham and Donaghy, 1982 |
Reduced pressure boiling point
Tboil (K) | Pressure (bar) | Reference |
---|---|---|
525.2 | 1.01 | Weast and Grasselli, 1989 |
524. to 526. | 1.01 | Buckingham and Donaghy, 1982 |

References

Aldrich Chemical Company Inc., 1990
Aldrich Chemical Company Inc.,
Catalog Handbook of Fine Chemicals, Aldrich Chemical Company, Inc., Milwaukee WI, 1990, 1. [all data]
Buckingham and Donaghy, 1982
Buckingham, J.; Donaghy, S.M.,
Dictionary of Organic Compounds: Fifth Edition, Chapman and Hall, New York, 1982, 1. [all data]
Weast and Grasselli, 1989
CRC Handbook of Data on Organic Compounds, 2nd Editon, Weast,R.C and Grasselli, J.G., ed(s)., CRC Press, Inc., Boca Raton, FL, 1989, 1. [all data]