3-Nitro-3-(4-nitrophenyl)pentane
- Formula: C11H14N2O4
- Molecular weight: 238.2399
- IUPAC Standard InChIKey: WRAJSZBVIQAHHW-UHFFFAOYSA-N
- CAS Registry Number: 204189-06-0
- Chemical structure:
View 3d structure (requires JavaScript / HTML 5) - Permanent link for this species. Use this link for bookmarking this species for future reference.

Phase change data

Data compiled by: William E. Acree, Jr., James S. Chickos
Quantity | Value | Units | Method | Reference | Comment |
---|---|---|---|---|---|
ΔvapH° | 90.5 ± 0.8 | kJ/mol | GS | Verevkin, 1997 | Based on data from 321. to 358. K. |
Quantity | Value | Units | Method | Reference | Comment |
ΔsubH° | 110.8 ± 0.8 | kJ/mol | Fus+Vap | Verevkin, 1997 |
Enthalpy of vaporization
ΔvapH (kJ/mol) | Temperature (K) | Method | Reference | Comment |
---|---|---|---|---|
88.0 ± 0.8 | 340. | GS | Verevkin, 1997 | Based on data from 321. to 358. K. |

References

Verevkin, 1997
Verevkin, Sergey P.,
Thermochemistry of nitro compounds. Experimental standard enthalpies of formation and improved group-additivity values,
Thermochimica Acta, 1997, 307, 1, 17-25, https://doi.org/10.1016/S0040-6031(97)00359-6
. [all data]