Cyclopentane, butyl-
- Formula: C9H18
- Molecular weight: 126.2392
- IUPAC Standard InChIKey: ZAGHKONXGGSVDV-UHFFFAOYSA-N
- CAS Registry Number: 2040-95-1
- Chemical structure:
View 3d structure (requires JavaScript / HTML 5) - Other names: Butylcyclopentane; n-Butylcyclopentane

Gas phase thermochemistry data

Data compiled as indicated in comments:
ALS - Hussein Y. Afeefy, Joel F. Liebman, and Stephen E. Stein
GT - Glushko Thermocenter, Russian Academy of Sciences, Moscow
Quantity | Value | Units | Method | Reference | Comment |
---|---|---|---|---|---|
ΔfH°gas | -168.3 ± 1.5 | kJ/mol | Ccb | Prosen, Johnson, et al., 1946 | ALS |
Quantity | Value | Units | Method | Reference | Comment |
S°gas | 453.80 | J/mol*K | N/A | Messerly J.F., 1965 | GT |

Condensed phase thermochemistry data

Data compiled as indicated in comments:
ALS - Hussein Y. Afeefy, Joel F. Liebman, and Stephen E. Stein
DH - Eugene S. Domalski and Elizabeth D. Hearing
Quantity | Value | Units | Method | Reference | Comment |
---|---|---|---|---|---|
ΔfH°liquid | -214.3 ± 1.5 | kJ/mol | Ccb | Prosen, Johnson, et al., 1946 | ALS |
Quantity | Value | Units | Method | Reference | Comment |
ΔcH°liquid | -5899.9 ± 1.4 | kJ/mol | Ccb | Prosen, Johnson, et al., 1946 | Corresponding ΔfHºliquid = -214.2 kJ/mol (simple calculation by NIST; no Washburn corrections); ALS |
Quantity | Value | Units | Method | Reference | Comment |
S°liquid | 343.84 | J/mol*K | N/A | Messerly, Todd, et al., 1965 | DH |
Constant pressure heat capacity of liquid
Cp,liquid (J/mol*K) | Temperature (K) | Reference | Comment |
---|---|---|---|
245.35 | 298.15 | Messerly, Todd, et al., 1965 | T = 12 to 370 K.; DH |

Phase change data

Data compiled as indicated in comments:
BS - Robert L. Brown and Stephen E. Stein
TRC - Thermodynamics Research Center, NIST Boulder Laboratories, Chris Muzny director
DRB - Donald R. Burgess, Jr.
AC - William E. Acree, Jr., James S. Chickos
DH - Eugene S. Domalski and Elizabeth D. Hearing
Quantity | Value | Units | Method | Reference | Comment |
---|---|---|---|---|---|
Tboil | 429.9 ± 0.4 | K | AVG | N/A | Average of 10 out of 12 values; Individual data points |
Quantity | Value | Units | Method | Reference | Comment |
Tfus | 165. ± 3. | K | AVG | N/A | Average of 8 values; Individual data points |
Quantity | Value | Units | Method | Reference | Comment |
Ttriple | 165.18 | K | N/A | Messerly, Todd, et al., 1965, 2 | Uncertainty assigned by TRC = 0.01 K; TRC |
Ttriple | 165.19 | K | N/A | Anonymous, 1959 | Uncertainty assigned by TRC = 0.6 K; TRC |
Quantity | Value | Units | Method | Reference | Comment |
Tc | 631. | K | N/A | Majer and Svoboda, 1985 | |
Quantity | Value | Units | Method | Reference | Comment |
ΔvapH° | 45.91 | kJ/mol | N/A | Majer and Svoboda, 1985 | |
ΔvapH° | 46.0 | kJ/mol | N/A | Prosen, Johnson, et al., 1946 | DRB |
Enthalpy of vaporization
ΔvapH (kJ/mol) | Temperature (K) | Method | Reference | Comment |
---|---|---|---|---|
36.16 | 429.8 | N/A | Majer and Svoboda, 1985 | |
39.4 | 422. | A | Stephenson and Malanowski, 1987 | Based on data from 413. to 432. K.; AC |
43.8 ± 0.1 | 328. | C | Svoboda, Charvátová, et al., 1981 | AC |
42.7 ± 0.1 | 343. | C | Svoboda, Charvátová, et al., 1981 | AC |
41.6 ± 0.1 | 358. | C | Svoboda, Charvátová, et al., 1981 | AC |
40.9 ± 0.1 | 368. | C | Svoboda, Charvátová, et al., 1981 | AC |
Enthalpy of vaporization
ΔvapH =
A exp(-βTr) (1 − Tr)β
ΔvapH =
Enthalpy of vaporization (at saturation pressure)
(kJ/mol)
Tr = reduced temperature (T / Tc)
View plot Requires a JavaScript / HTML 5 canvas capable browser.
Temperature (K) | A (kJ/mol) | β | Tc (K) | Reference | Comment |
---|---|---|---|---|---|
328. to 368. | 66.61 | 0.335 | 631. | Majer and Svoboda, 1985 |
Enthalpy of fusion
ΔfusH (kJ/mol) | Temperature (K) | Reference | Comment |
---|---|---|---|
11.314 | 165.18 | Messerly, Todd, et al., 1965 | DH |
11.31 | 165.2 | Domalski and Hearing, 1996 | AC |
Entropy of fusion
ΔfusS (J/mol*K) | Temperature (K) | Reference | Comment |
---|---|---|---|
68.49 | 165.18 | Messerly, Todd, et al., 1965 | DH |

Gas phase ion energetics data

Data compiled by: Sharon G. Lias, Rhoda D. Levin, and Sherif A. Kafafi
Ionization energy determinations
IE (eV) | Method | Reference |
---|---|---|
9.95 ± 0.03 | PE | Rang, Paldoia, et al., 1974 |

Kovats' RI, non-polar column, isothermal

Column type | Active phase | Temperature (C) | I | Reference | Comment |
---|---|---|---|---|---|
Capillary | OV-1 | 100. | 938.3 | Anders, Anders, et al., 1985 | 55. m/0.21 mm/0.35 μm, N2 |
Capillary | DB-1 | 60. | 929.4 | Lubeck and Sutton, 1983 | Column length: 60. m; Column diameter: 0.264 mm |
Capillary | DB-1 | 60. | 929.8 | Lubeck and Sutton, 1983 | 60. m/0.259 mm/1. μm |
Capillary | Squalane | 86. | 936.4 | Nabivach and Kirilenko, 1979 | N2; Column length: 50. m |
Capillary | Squalane | 86. | 937.2 | Nabivach and Kirilenko, 1979 | N2; Column length: 50. m |
Capillary | Squalane | 86. | 937.8 | Nabivach and Kirilenko, 1979 | N2; Column length: 50. m |
Packed | Squalane | 100. | 938. | Bogoslovsky, Anvaer, et al., 1978 | |
Packed | Squalane | 120. | 942. | Bogoslovsky, Anvaer, et al., 1978 | |
Packed | Squalane | 60. | 930. | Bogoslovsky, Anvaer, et al., 1978 | |
Packed | Squalane | 80. | 934. | Bogoslovsky, Anvaer, et al., 1978 | |
Capillary | Squalane | 86. | 936.4 | Nabivach, Bur'yan, et al., 1978 | Column length: 50. m; Column diameter: 0.25 mm |
Capillary | Squalane | 96. | 937.1 | Nabivach, Bur'yan, et al., 1978 | Column length: 50. m; Column diameter: 0.25 mm |
Capillary | Squalane | 100. | 937. | Rang, Orav, et al., 1977 | Nitrogen or helium; Column length: 100. m; Column diameter: 0.25 mm |
Capillary | Squalane | 100. | 938. | Dielmann, Schwengers, et al., 1974 | Column length: 100. m; Column diameter: 0.25 mm |
Capillary | Squalane | 120. | 942. | Dielmann, Schwengers, et al., 1974 | Column length: 100. m; Column diameter: 0.25 mm |
Capillary | Squalane | 60. | 930. | Dielmann, Schwengers, et al., 1974 | Column length: 100. m; Column diameter: 0.25 mm |
Capillary | Squalane | 80. | 934. | Dielmann, Schwengers, et al., 1974 | Column length: 100. m; Column diameter: 0.25 mm |
Packed | SE-30 | 110. | 940. | Mitra, Mohan, et al., 1974 | N2, Chrom W; Column length: 6.1 m |
Packed | SE-30 | 120. | 944. | Mitra, Mohan, et al., 1974 | N2, Chrom W; Column length: 6.1 m |
Packed | SE-30 | 130. | 946. | Mitra, Mohan, et al., 1974 | N2, Chrom W; Column length: 6.1 m |
Packed | SE-30 | 140. | 949. | Mitra, Mohan, et al., 1974 | N2, Chrom W; Column length: 6.1 m |

Kovats' RI, non-polar column, temperature ramp

Column type | Active phase | I | Reference | Comment |
---|---|---|---|---|
Capillary | DB-1 | 931. | Takeoka, Perrino, et al., 1996 | 60. m/0.25 mm/0.25 μm, 30. C @ 4. min, 2. K/min; Tend: 220. C |
Capillary | DB-1 | 932. | Takeoka, Perrino, et al., 1996 | 60. m/0.25 mm/0.25 μm, 30. C @ 4. min, 2. K/min; Tend: 220. C |
Capillary | Apiezon L | 947. | Louis, 1971 | N2, 1. K/min; Column length: 50. m; Column diameter: 0.25 mm; Tstart: 60. C |

Kovats' RI, non-polar column, custom temperature program

Column type | Active phase | I | Reference | Comment |
---|---|---|---|---|
Capillary | Petrocol DH-100 | 935.85 | Haagen-Smit Laboratory, 1997 | He; Column length: 100. m; Column diameter: 0.2 mm; Program: 5C(10min) => 5C/min => 50C(48min) => 1.5C/min => 195C(91min) |

Kovats' RI, polar column, isothermal

Column type | Active phase | Temperature (C) | I | Reference | Comment |
---|---|---|---|---|---|
Capillary | PEG 4000 | 100. | 1009. | Rang, Orav, et al., 1988 | |
Capillary | PEG 4000 | 60. | 993. | Rang, Orav, et al., 1988 | |
Capillary | PEG 4000 | 70. | 997. | Rang, Orav, et al., 1988 | |
Capillary | PEG 4000 | 80. | 1001. | Rang, Orav, et al., 1988 | |
Capillary | PEG-20M | 100. | 997. | Rang, Orav, et al., 1988 | |
Capillary | PEG-20M | 110. | 1000. | Rang, Orav, et al., 1988 | |
Capillary | PEG-20M | 120. | 1004. | Rang, Orav, et al., 1988 | |
Capillary | PEG-20M | 80. | 989. | Rang, Orav, et al., 1988 | |
Capillary | PEG-20M | 90. | 994. | Rang, Orav, et al., 1988 | |
Capillary | PEG-20M | 100. | 996.7 | Orav, Kuningas, et al., 1982 | He; Column length: 100. m; Column diameter: 0.25 mm |
Capillary | PEG-20M | 110. | 1000.5 | Orav, Kuningas, et al., 1982 | He; Column length: 100. m; Column diameter: 0.25 mm |
Capillary | PEG-20M | 120. | 1004.5 | Orav, Kuningas, et al., 1982 | He; Column length: 100. m; Column diameter: 0.25 mm |
Capillary | PEG-20M | 80. | 988.9 | Orav, Kuningas, et al., 1982 | He; Column length: 100. m; Column diameter: 0.25 mm |
Capillary | PEG-20M | 90. | 993.8 | Orav, Kuningas, et al., 1982 | He; Column length: 100. m; Column diameter: 0.25 mm |
Capillary | PEG 4000 | 100. | 1009. | Rang, Orav, et al., 1977 | Nitrogen or Helium; Column length: 45. m; Column diameter: 0.25 mm |

Van Den Dool and Kratz RI, non-polar column, temperature ramp

Column type | Active phase | I | Reference | Comment |
---|---|---|---|---|
Capillary | CP-Sil 8CB-MS | 936. | Elmore, Cooper, et al., 2005 | 0. m/0.25 mm/0.25 μm, He, 40. C @ 2. min, 4. K/min, 280. C @ 5. min |
Capillary | Ultra-1 | 931. | Olson, Sinkevitch, et al., 1992 | 4. K/min; Tstart: -40. C; Tend: 230. C |
Capillary | Petrocol DH | 930. | White, Hackett, et al., 1992 | 100. m/0.25 mm/0.5 μm, He, 1. K/min; Tstart: 30. C; Tend: 220. C |

Van Den Dool and Kratz RI, non-polar column, custom temperature program

Column type | Active phase | I | Reference | Comment |
---|---|---|---|---|
Capillary | CP-Sil 8CB-MS | 937. | Elmore, Mottram, et al., 2000 | 60. m/0.25 mm/0.25 μm, He; Program: 0C(5min) => 40C/min => 40C (2min) => 4C/min => 280C |

Normal alkane RI, non-polar column, temperature ramp

Column type | Active phase | I | Reference | Comment |
---|---|---|---|---|
Capillary | Petrocol DH | 934. | Supelco, 2012 | 100. m/0.25 mm/0.50 μm, Helium, 20. C @ 15. min, 15. K/min, 220. C @ 30. min |
Capillary | MDN-5 | 937. | van Loon, Linssen, et al., 2005 | 60. m/0.25 mm/0.25 μm, He, 40. C @ 4. min, 4. K/min, 270. C @ 5. min |
Capillary | DB-5 | 941. | Macku and Shibamoto, 1991 | He, 40. C @ 5. min, 2. K/min; Column length: 60. m; Column diameter: 0.25 mm; Tend: 160. C |

Normal alkane RI, non-polar column, custom temperature program

Column type | Active phase | I | Reference | Comment |
---|---|---|---|---|
Capillary | Squalane | 930. | Chen, 2008 | Program: not specified |

Normal alkane RI, polar column, temperature ramp

Column type | Active phase | I | Reference | Comment |
---|---|---|---|---|
Capillary | RTX-Wax | 979. | Galindo-Cuspinera, Lubran, et al., 2002 | 60. m/0.25 mm/0.5 μm, He, 40. C @ 5. min, 5. K/min, 180. C @ 20. min |
Capillary | DB-Wax | 971. | Horiuchi, Umano, et al., 1998 | 60. m/0.25 mm/1. μm, He, 3. K/min, 200. C @ 40. min; Tstart: 50. C |

References

Prosen, Johnson, et al., 1946
Prosen, E.J.; Johnson, W.H.; Rossini, F.D.,
Heats of formation and combustion of the normal alkylcyclopentanes and cyclohexanes and the increment per CH2 group for several homologous series of hydrocarbons,
J. Res. NBS, 1946, 37, 51-56. [all data]
Messerly J.F., 1965
Messerly J.F.,
Low-temperature thermodynamic properties of n-propyl-, n-butyl-, and n-decyl-substituted cyclopentanes,
J. Phys. Chem., 1965, 69, 353-359. [all data]
Messerly, Todd, et al., 1965
Messerly, J.F.; Todd, S.S.; Finke, H.L.,
Low-temperature thermodynamic properties of n-propyl-, n-butyl-, and n-decyl-substituted cyclopentanes,
J. Phys. Chem., 1965, 69, 353-359. [all data]
Messerly, Todd, et al., 1965, 2
Messerly, J.F.; Todd, S.S.; Finke, H.L.,
Low-Temperature Thermodynamic Properties of n-Propyl, n-Butyl and n-Decyl-Substituted Cyclopentanes,
J. Phys. Chem., 1965, 69, 353-9. [all data]
Anonymous, 1959
Anonymous, X.,
Unpublished, 1959, Bartlesville, OK 1959. [all data]
Majer and Svoboda, 1985
Majer, V.; Svoboda, V.,
Enthalpies of Vaporization of Organic Compounds: A Critical Review and Data Compilation, Blackwell Scientific Publications, Oxford, 1985, 300. [all data]
Stephenson and Malanowski, 1987
Stephenson, Richard M.; Malanowski, Stanislaw,
Handbook of the Thermodynamics of Organic Compounds, 1987, https://doi.org/10.1007/978-94-009-3173-2
. [all data]
Svoboda, Charvátová, et al., 1981
Svoboda, Václav; Charvátová, Vladimíra; Majer, Vladimír; Pick, Jirí,
Determination of heats of vaporization and some other thermodynamic quantities for four alkylcycloparaffins,
Collect. Czech. Chem. Commun., 1981, 46, 12, 2983-2988, https://doi.org/10.1135/cccc19812983
. [all data]
Domalski and Hearing, 1996
Domalski, Eugene S.; Hearing, Elizabeth D.,
Heat Capacities and Entropies of Organic Compounds in the Condensed Phase. Volume III,
J. Phys. Chem. Ref. Data, 1996, 25, 1, 1, https://doi.org/10.1063/1.555985
. [all data]