2',6'-Dimethoxyacetophenone
- Formula: C10H12O3
- Molecular weight: 180.2005
- IUPAC Standard InChIKey: XEUGKOFTNAYMMX-UHFFFAOYSA-N
- CAS Registry Number: 2040-04-2
- Chemical structure:
View 3d structure (requires JavaScript / HTML 5) - Other names: 2,6-Dimethoxyacetophenone; Ethanone, 1-(2,6-dimethoxyphenyl)-; Acetophenone, 2',6'-dimethoxy-; USAF K-2801; 2',6'-Dihydroxyacetophenone, dimethyl ether; 1-(2,6-Dimethoxyphenyl)ethanone; 1-(2,6-dimethoxyphenyl)ethan-1-one

Van Den Dool and Kratz RI, non-polar column, temperature ramp

Column type | Active phase | I | Reference | Comment |
---|---|---|---|---|
Capillary | VF-5MS | 1480. | Todua, 2011 | 30. m/0.25 mm/0.25 μm, He; Tstart: 60. C; Tend: 270. C |

Van Den Dool and Kratz RI, non-polar column, custom temperature program

Column type | Active phase | I | Reference | Comment |
---|---|---|---|---|
Capillary | VF-5MS | 1468.7 | Tret'yakov, 2008 | 30. m/0.25 mm/0.25 μm, He; Program: Multi-step temperature program; T(initial)=60C; T(final)=270C |

References

Todua, 2011
Todua, N.G.,
Retention Data. NIST Mass Spectrometry Data Center., NIST Mass Spectrometry Data Center, 2011. [all data]
Tret'yakov, 2008
Tret'yakov, K.V.,
Retention Data. NIST Mass Spectrometry Data Center., NIST Mass Spectrometry Data Center, 2008. [all data]