Benzene, 2-ethenyl-1,3-dimethyl-
- Formula: C10H12
- Molecular weight: 132.2023
- IUPAC Standard InChIKey: OWRKXOZFTROHSH-UHFFFAOYSA-N
- CAS Registry Number: 2039-90-9
- Chemical structure:
View 3d structure (requires JavaScript / HTML 5) - Other names: Styrene, 2,6-dimethyl-; 1,3-Dimethyl-2-vinylbenzene; 2,6-Dimethylstyrene; 1,3-Dimethyl-2-ethenylbenzene

Phase change data

Data compiled as indicated in comments:
BS - Robert L. Brown and Stephen E. Stein
TRC - Thermodynamics Research Center, NIST Boulder Laboratories, Chris Muzny director
Quantity | Value | Units | Method | Reference | Comment |
---|---|---|---|---|---|
Tfus | 234.50 | K | N/A | Schwartzman and Corson, 1956 | Uncertainty assigned by TRC = 0.4 K; TRC |
Reduced pressure boiling point
Tboil (K) | Pressure (bar) | Reference | Comment |
---|---|---|---|
339.2 | 0.013 | Weast and Grasselli, 1989 | BS |

Kovats' RI, non-polar column, isothermal

Column type | Active phase | Temperature (C) | I | Reference | Comment |
---|---|---|---|---|---|
Capillary | SE-30 | 130. | 1078. | Bredael, 1982 | Column length: 100. m; Column diameter: 0.5 mm |
Capillary | SE-30 | 80. | 1060. | Bredael, 1982 | Column length: 100. m; Column diameter: 0.5 mm |
Capillary | SE-30 | 65. | 1117.9 | Svob and Deur-Siftar, 1974 | He; Column length: 25.5 m; Column diameter: 0.5 mm |

Normal alkane RI, non-polar column, temperature ramp

Column type | Active phase | I | Reference | Comment |
---|---|---|---|---|
Capillary | DB-1 | 1070. | Butrym and Hartman, 2003 | 60. m/0.53 mm/0.5 μm, 10. K/min, 280. C @ 5. min; Tstart: -20. C |

Gas phase ion energetics data

Data compiled as indicated in comments:
LLK - Sharon G. Lias, Rhoda D. Levin, and Sherif A. Kafafi

Ionization energy determinations

IE (eV) Method Reference Comment
8.10 ± 0.02PEMaier and Turner, 1973LLK
8.48PEKobayashi, Yokota, et al., 1973Vertical value; LLK

References

Schwartzman and Corson, 1956
Schwartzman, L.H.; Corson, B.B.,
Steric Hinderance. II. The Rates of Dehalogenation of Methyl- and Dimethylstyrene Dibromides,
J. Am. Chem. Soc., 1956, 78, 322. [all data]
Weast and Grasselli, 1989
CRC Handbook of Data on Organic Compounds, 2nd Editon, Weast,R.C and Grasselli, J.G., ed(s)., CRC Press, Inc., Boca Raton, FL, 1989, 1. [all data]