2-Chlorostyrene
- Formula: C8H7Cl
- Molecular weight: 138.594
- IUPAC Standard InChIKey: ISRGONDNXBCDBM-UHFFFAOYSA-N
- CAS Registry Number: 2039-87-4
- Chemical structure:
View 3d structure (requires JavaScript / HTML 5) - Other names: o-Chlorostyrene; Benzene, 1-chloro-2-ethenyl-; Styrene, o-chloro-; 1-Chloro-2-vinylbenzene

Phase change data

Data compiled as indicated in comments:
BS - Robert L. Brown and Stephen E. Stein
AC - William E. Acree, Jr., James S. Chickos
Quantity | Value | Units | Method | Reference | Comment |
---|---|---|---|---|---|
Tboil | 461.9 | K | N/A | Weast and Grasselli, 1989 | BS |
Reduced pressure boiling point
Tboil (K) | Pressure (bar) | Reference | Comment |
---|---|---|---|
332.2 | 0.009 | Aldrich Chemical Company Inc., 1990 | BS |
337.8 | 0.013 | Weast and Grasselli, 1989 | BS |
Enthalpy of vaporization
ΔvapH (kJ/mol) | Temperature (K) | Method | Reference | Comment |
---|---|---|---|---|
46.0 | 378. | A | Stephenson and Malanowski, 1987 | Based on data from 363. to 523. K. See also Dykyj and Vanko, 1970.; AC |

References

Weast and Grasselli, 1989
CRC Handbook of Data on Organic Compounds, 2nd Editon, Weast,R.C and Grasselli, J.G., ed(s)., CRC Press, Inc., Boca Raton, FL, 1989, 1. [all data]
Aldrich Chemical Company Inc., 1990
Aldrich Chemical Company Inc.,
Catalog Handbook of Fine Chemicals, Aldrich Chemical Company, Inc., Milwaukee WI, 1990, 1. [all data]
Stephenson and Malanowski, 1987
Stephenson, Richard M.; Malanowski, Stanislaw,
Handbook of the Thermodynamics of Organic Compounds, 1987, https://doi.org/10.1007/978-94-009-3173-2
. [all data]
Dykyj and Vanko, 1970
Dykyj, J.; Vanko, A.,
Petrochemica, 1970, 10, 1, 3. [all data]