3,4-Dichlorostyrene
- Formula: C8H6Cl2
- Molecular weight: 173.039
- IUPAC Standard InChIKey: BJQFWAQRPATHTR-UHFFFAOYSA-N
- CAS Registry Number: 2039-83-0
- Chemical structure:
View 3d structure (requires JavaScript / HTML 5) - Other names: Benzene, 1,2-dichloro-4-ethenyl-; 1,2-Dichloro-4-vinylbenzene

Phase change data

Data compiled as indicated in comments:
BS - Robert L. Brown and Stephen E. Stein
AC - William E. Acree, Jr., James S. Chickos
Reduced pressure boiling point
Tboil (K) | Pressure (bar) | Reference | Comment |
---|---|---|---|
342.7 | 0.005 | Weast and Grasselli, 1989 | BS |
368.2 | 0.007 | Weast and Grasselli, 1989 | BS |
Enthalpy of vaporization
ΔvapH (kJ/mol) | Temperature (K) | Method | Reference | Comment |
---|---|---|---|---|
53.3 | 345. | A | Stephenson and Malanowski, 1987 | Based on data from 330. to 503. K. See also Stull, 1947 and Dykyj and Vanko, 1970.; AC |
Antoine Equation Parameters
log10(P) = A − (B / (T + C))
P = vapor pressure (bar)
T = temperature (K)
View plot Requires a JavaScript / HTML 5 canvas capable browser.
Temperature (K) | A | B | C | Reference | Comment |
---|---|---|---|---|---|
330.4 to 503. | 4.86763 | 2266.199 | -37.568 | Stull, 1947 | Coefficents calculated by NIST from author's data. |

References

Weast and Grasselli, 1989
CRC Handbook of Data on Organic Compounds, 2nd Editon, Weast,R.C and Grasselli, J.G., ed(s)., CRC Press, Inc., Boca Raton, FL, 1989, 1. [all data]
Stephenson and Malanowski, 1987
Stephenson, Richard M.; Malanowski, Stanislaw,
Handbook of the Thermodynamics of Organic Compounds, 1987, https://doi.org/10.1007/978-94-009-3173-2
. [all data]
Stull, 1947
Stull, Daniel R.,
Vapor Pressure of Pure Substances. Organic and Inorganic Compounds,
Ind. Eng. Chem., 1947, 39, 4, 517-540, https://doi.org/10.1021/ie50448a022
. [all data]
Dykyj and Vanko, 1970
Dykyj, J.; Vanko, A.,
Petrochemica, 1970, 10, 1, 3. [all data]