1,1,3-Trichloropropane
- Formula: C3H5Cl3
- Molecular weight: 147.431
- IUPAC Standard InChIKey: URWHLZCXYCQNSY-UHFFFAOYSA-N
- CAS Registry Number: 20395-25-9
- Chemical structure:
View 3d structure (requires JavaScript / HTML 5) - Permanent link for this species. Use this link for bookmarking this species for future reference.

Phase change data

Data compiled as indicated in comments:
TRC - Thermodynamics Research Center, NIST Boulder Laboratories, Chris Muzny director
AC - William E. Acree, Jr., James S. Chickos
Quantity | Value | Units | Method | Reference | Comment |
---|---|---|---|---|---|
Tboil | 418.7 | K | N/A | Slabey, 1952 | Uncertainty assigned by TRC = 0.5 K; TRC |
Tboil | 421.15 | K | N/A | Ewell and Welch, 1941 | Uncertainty assigned by TRC = 2. K; TRC |
Tboil | 416.65 | K | N/A | Kirrmann, Pacaud, et al., 1934 | Uncertainty assigned by TRC = 3. K; TRC |
Tboil | 420. | K | N/A | Romburgh, 1882 | Uncertainty assigned by TRC = 3. K; TRC |
Quantity | Value | Units | Method | Reference | Comment |
Tfus | 214.17 | K | N/A | Slabey, 1952 | Uncertainty assigned by TRC = 0.6 K; TRC |
Enthalpy of vaporization
ΔvapH (kJ/mol) | Temperature (K) | Method | Reference | Comment |
---|---|---|---|---|
41.8 | 343. | A | Stephenson and Malanowski, 1987 | Based on data from 328. to 464. K. See also Dykyj, 1970.; AC |

References

Slabey, 1952
Slabey, V.A.,
Reaction of Cyclopropyl Chloride with Lithium. Isolation of Dicyclopropyl,
J. Am. Chem. Soc., 1952, 74, 4928-30. [all data]
Ewell and Welch, 1941
Ewell, R.H.; Welch, L.M.,
Maximum Boiling Mixtures of chloroparaffins with Donor Liquids,
J. Am. Chem. Soc., 1941, 63, 2475. [all data]
Kirrmann, Pacaud, et al., 1934
Kirrmann, A.; Pacaud; Dosque, H.,
Bull. Soc. Chim. Fr., 1934, 1, 860. [all data]
Romburgh, 1882
Romburgh, M.P.,
Bull. Soc. Chim. Fr., 1882, 37, 98. [all data]
Stephenson and Malanowski, 1987
Stephenson, Richard M.; Malanowski, Stanislaw,
Handbook of the Thermodynamics of Organic Compounds, 1987, https://doi.org/10.1007/978-94-009-3173-2
. [all data]
Dykyj, 1970
Dykyj, J.,
Petrochemica, 1970, 10, 2, 51. [all data]