Propylene oxide clathrate hydrate
- Formula: C3H6O·H34O17
- Molecular weight: 364.3389
- CAS Registry Number: 20392-75-0

Phase change data

Data compiled as indicated in comments:
TRC - Thermodynamics Research Center, NIST Boulder Laboratories, Chris Muzny director
DH - Eugene S. Domalski and Elizabeth D. Hearing
Quantity | Value | Units | Method | Reference | Comment |
---|---|---|---|---|---|
Tfus | 268.6 | K | N/A | Handa, 1985 | Crystal phase 1 phase; Uncertainty assigned by TRC = 0.1 K; TRC |
Enthalpy of fusion
ΔfusH (kJ/mol) | Temperature (K) | Reference | Comment |
---|---|---|---|
92.700 | 268.6 | Handa, 1985, 2 | DH |
Entropy of fusion
ΔfusS (J/mol*K) | Temperature (K) | Reference | Comment |
---|---|---|---|
345.1 | 268.6 | Handa, 1985, 2 | DH |

References

Handa, 1985
Handa, Y.P.,
Heat capacities in the ranges 95 to 260 k and enthalpies of fusion for structure-II clathrate hydrates of some cyclic ethers,
J. Chem. Thermodyn., 1985, 17, 201-8. [all data]
Handa, 1985, 2
Handa, Y.P.,
Heat capacities in the range 95 to 260 K and enthalpies of fusion for structure-II clathrate hydrates of some cyclic ethers,
J. Chem. Thermodynam., 1985, 17, 201-208. [all data]