N,N-Diisopropylbenzamide
- Formula: C13H19NO
- Molecular weight: 205.2961
- IUPAC Standard InChIKey: UYXMMJPYFKRKKM-UHFFFAOYSA-N
- CAS Registry Number: 20383-28-2
- Chemical structure:
View 3d structure (requires JavaScript / HTML 5) - Other names: Benzamide, N,N-diisopropyl

Phase change data

Data compiled by: Robert L. Brown and Stephen E. Stein
Reduced pressure boiling point
Tboil (K) | Pressure (bar) | Reference |
---|---|---|
421. to 425. | 0.024 | Frinton Laboratories Inc., 1986 |

Normal alkane RI, non-polar column, custom temperature program

Column type | Active phase | I | Reference | Comment |
---|---|---|---|---|
Capillary | Polydimethyl siloxanes | 1524. | Zenkevich and Chupalov, 1996 | Program: not specified |

References

Frinton Laboratories Inc., 1986
Frinton Laboratories Inc.,
Catalog Number 11, Frinton Laboratories Inc., Vineland, NJ, 1986, 99. [all data]
Zenkevich and Chupalov, 1996
Zenkevich, I.G.; Chupalov, A.A.,
New Possibilities of Chromato Mass Pectrometric Identification of Organic Compounds Using Increments of Gas Chromatographic Retention Indices of Molecular Structural Fragments,
Zh. Org. Khim. (Rus.), 1996, 32, 5, 656-666. [all data]