1H-Phenalene
- Formula: C13H10
- Molecular weight: 166.2185
- IUPAC Standard InChIKey: XDJOIMJURHQYDW-UHFFFAOYSA-N
- CAS Registry Number: 203-80-5
- Chemical structure:
View 3d structure (requires JavaScript / HTML 5) - Other names: Phenalene; Peri-Naphthindene; Perinaphthene; 1H-Benzonaphthene

Gas phase ion energetics data

Data compiled by: John E. Bartmess
De-protonation reactions
C13H9- + =
By formula: C13H9- + H+ = C13H10
Quantity | Value | Units | Method | Reference | Comment |
---|---|---|---|---|---|
ΔrH° | 1468. ± 16. | kJ/mol | D-EA | Gygax, Peters, et al., 1979 | gas phase; BDE: 65±2 kcal/mol, Gerst and Rüchardt, 1993 |
Quantity | Value | Units | Method | Reference | Comment |
ΔrG° | 1440. ± 16. | kJ/mol | H-TS | Gygax, Peters, et al., 1979 | gas phase; BDE: 65±2 kcal/mol, Gerst and Rüchardt, 1993 |

Lee's RI, non-polar column, temperature ramp

View large format table.

Column type Active phase I Reference Comment
CapillaryHP-5268.0Wang, Hou, et al., 200730. m/0.30 mm/0.25 μm, Helium, 50. C @ 5. min, 5. K/min, 200. C @ 15. min
CapillaryHP-5268.Shao, Wang, et al., 200630. m/0.3 mm/0.25 μm, He, 50. C @ 5. min, 5. K/min, 200. C @ 15. min
CapillaryHP-5266.90Piao, Chu, et al., 199930. m/0.25 mm/0.25 μm, 50. C @ 2. min, 4. K/min, 280. C @ 20. min

Lee's RI, non-polar column, custom temperature program

View large format table.

Column type Active phase I Reference Comment
CapillaryDB-5267.8Fuentes, Font, et al., 2007Column length: 60. m; Program: not specified
CapillaryDB-5MS267.2Aracil, Font, et al., 2005Column length: 60. m; Column diameter: 0.25 mm; Program: not specified
CapillaryHP-5MS266.80Cheng, Liu, et al., 200530. m/0.30 mm/0.25 μm, He; Program: 50 0C (2 min) 8 0C/min -> 120 0C (3 min) 10 0C/min -> 230 0C
CapillaryLM-5258.62Ré-Poppi and Santiago-Silva, 200230. m/0.25 mm/0.25 μm, He; Program: 60C(2min) => 15C/min => 180C => 5C/min => 280C(5min)

Reaction thermochemistry data

Data compiled by: John E. Bartmess

Individual Reactions

C13H9- + Hydrogen cation = 1H-Phenalene

By formula: C13H9- + H+ = C13H10

Quantity Value Units Method Reference Comment
Δr350.9 ± 3.8kcal/molD-EAGygax, Peters, et al., 1979gas phase; BDE: 65±2 kcal/mol, Gerst and Rüchardt, 1993
Quantity Value Units Method Reference Comment
Δr344.2 ± 3.9kcal/molH-TSGygax, Peters, et al., 1979gas phase; BDE: 65±2 kcal/mol, Gerst and Rüchardt, 1993

References

Gygax, Peters, et al., 1979
Gygax, R.; Peters, H.L.; Brauman, J.I.,
Photodetachment of electrons from anions of high symmetry. Electron photodetachment spectra of the cycloctatetraenyl and perinaphthenyl anions,
J. Am. Chem. Soc., 1979, 101, 2567. [all data]
Gerst and Rüchardt, 1993
Gerst, M.; Rüchardt, C.,
H-Transferreaktionen mit Phenalen,
Chem. Ber., 1993, 126, 4, 1039, https://doi.org/10.1002/cber.19931260426
. [all data]