2H-Inden-2-one, octahydro-3a-methyl-, trans-
- Formula: C10H16O
- Molecular weight: 152.2334
- IUPAC Standard InChIKey: AMBOSHXMUMOHBF-WPRPVWTQSA-N
- CAS Registry Number: 20379-99-1
- Chemical structure:
View 3d structure (requires JavaScript / HTML 5) - Stereoisomers:
- Other names: 2-Indanone, hexahydro-3a-methyl-, trans-; 3a-Methyloctahydro-2H-inden-2-one, (E)-

Gas phase thermochemistry data

Data compiled by: Hussein Y. Afeefy, Joel F. Liebman, and Stephen E. Stein
Quantity | Value | Units | Method | Reference | Comment |
---|---|---|---|---|---|
ΔfH°gas | -275.2 ± 2.3 | kJ/mol | Ccr | Sellers, 1970 |

Condensed phase thermochemistry data

Data compiled by: Hussein Y. Afeefy, Joel F. Liebman, and Stephen E. Stein
Quantity | Value | Units | Method | Reference | Comment |
---|---|---|---|---|---|
ΔfH°liquid | -333.5 ± 2.2 | kJ/mol | Ccr | Sellers, 1970 | |
Quantity | Value | Units | Method | Reference | Comment |
ΔcH°liquid | -5888.2 ± 2.2 | kJ/mol | Ccr | Sellers, 1970 | Corresponding ΔfHºliquid = -333.51 kJ/mol (simple calculation by NIST; no Washburn corrections) |

Phase change data

Data compiled as indicated in comments:
AC - William E. Acree, Jr., James S. Chickos
ALS - Hussein Y. Afeefy, Joel F. Liebman, and Stephen E. Stein
Quantity | Value | Units | Method | Reference | Comment |
---|---|---|---|---|---|
ΔvapH° | 58.3 ± 0.2 | kJ/mol | C | Sellers, Gram, et al., 1970 | AC |
ΔvapH° | 58.32 ± 0.17 | kJ/mol | C | Sellers, 1970 | ALS |

References

Sellers, 1970
Sellers, P.,
Enthalpies of formation of cis- and trans-8-Methyl-2-hydrindanome,
Acta Chem. Scand., 1970, 24, 2453-2358. [all data]
Sellers, Gram, et al., 1970
Sellers, Peter; Gram, F.; Groth, P.; Klewe, B.; Rømming, Chr.,
Enthalpies of Formation of cis- and trans-8-Methyl-2-hydrindanone.,
Acta Chem. Scand., 1970, 24, 2453-2458, https://doi.org/10.3891/acta.chem.scand.24-2453
. [all data]